program: Gaussian 09
title: 000114829
version: EM64L-G09RevD.01
frameworkgroup: C1[X(C15H12O4)]
method: RPBEPBE
basis: SDD
operation: Freq
keyword: #pfreq=noraman
keyword: PBEPBE/SDD
title: #p freq=noraman PBEPBE/SDD
converged: YES YES NO NO
title: Mulliken charges:
elementType: O O O O C C C C C C C C C C C C C C C H H H H H H H H H H H H
charge: -0.275950 -0.219883 -0.419868 -0.429598 -0.224126 -0.540260 0.519621 0.078027 0.192112 0.269730 -0.436939 -0.346111 -0.344353 -0.511339 0.332842 -0.414046 -0.343748 -0.388698 0.282947 0.238885 0.260713 0.255039 0.236165 0.250580 0.276978 0.281282 0.227621 0.253913 0.221088 0.361543 0.355835
chargesum: 0.00000
title: Mulliken charges with hydrogens summed into heavy atoms:
elementType: O O O O C C C C C C C C C C C C C C C
charge: -0.275950 -0.219883 -0.058325 -0.073764 0.014759 -0.024508 0.519621 0.078027 0.192112 0.269730 -0.200774 -0.095531 -0.067375 -0.230058 0.332842 -0.186425 -0.089835 -0.167610 0.282947
polarizability: 2.69979346e+02 -6.95790737e+00 1.65993912e+02 1.31396459e+00 9.97675073e+00 1.10188237e+02
1716.lowfreq: -7.8092 -5.3482 -0.0008 -0.0008 -0.0004 5.3817 17.6256 46.3931 49.8868
frequency: 17.3078 46.3893 49.8823 99.9541 104.0271 155.3720 178.9210 221.6463 241.1500 259.2691 284.3505 342.3427 362.0325 375.3220 389.6957 393.4595 409.4771 425.9077 447.7213 454.8198 500.5618 514.1023 534.9163 566.2414 609.9265 622.3162 632.7863 651.1025 686.3900 723.1677 735.4962 736.3644 793.4116 804.0743 810.8667 823.2670 835.8623 867.6407 870.6137 938.5357 942.5706 959.5306 964.3295 976.9347 1004.2394 1033.7573 1053.1713 1102.3300 1109.1557 1134.2062 1144.6633 1165.3010 1179.2914 1182.7547 1219.0352 1223.0025 1249.5321 1253.4909 1265.5030 1296.0328 1310.8234 1318.0002 1348.4928 1399.6598 1401.5914 1424.9272 1428.8877 1450.1287 1489.4126 1507.7546 1570.0650 1588.3895 1600.1178 1628.6940 1637.9334 2975.6108 2993.4252 3081.2856 3115.9184 3126.6491 3126.7656 3154.4583 3158.5728 3173.2917 3188.1375 3580.4987 3581.8056
redmass: 4.0461 5.7211 6.6333 7.7635 3.9447 5.1379 5.5160 6.3697 6.7435 6.6877 5.1156 7.3288 1.1141 5.6744 3.8668 1.1179 2.9463 3.8363 4.6768 4.1367 4.0327 3.7857 3.2556 3.6719 6.1189 4.4289 6.7275 4.2810 4.4620 4.7931 3.9380 4.2633 4.0692 1.6242 1.3629 3.2429 1.7613 2.9135 1.9457 1.4259 2.6247 1.3712 1.6807 2.2237 2.7710 5.4935 3.3479 1.4316 1.7594 1.3885 1.3453 1.3177 1.1183 1.5462 1.8688 1.6269 2.1100 1.9402 2.8433 2.1114 1.5629 1.3342 1.7428 5.1737 6.2730 1.1082 2.7272 3.7979 3.4051 2.8608 7.7007 9.9613 6.4752 6.3904 7.1572 1.0824 1.0672 1.0961 1.0893 1.0892 1.0900 1.0949 1.0955 1.0952 1.0928 1.0660 1.0660
irintensity: 1.3430 0.7287 0.5385 2.7659 9.0332 0.8807 1.0459 2.5003 3.8199 7.0707 1.7555 2.7158 141.9701 8.2820 8.0755 142.2220 1.9261 1.1007 0.8875 5.1715 18.8433 30.2813 8.7337 16.1034 4.2932 11.6344 4.6365 9.7128 3.7419 3.5599 0.9210 3.9268 8.9761 55.0643 15.0204 28.9138 23.2719 34.7816 34.8883 3.6361 61.5854 1.7702 42.9603 47.9287 2.0886 12.0610 59.3341 52.0935 404.6508 22.6860 218.8516 44.1732 17.9788 33.6154 0.7115 33.6831 38.8345 13.2011 88.0820 43.0926 71.5215 32.1938 130.9280 11.3699 96.0262 9.4779 8.0937 134.1851 0.8333 78.3050 47.2733 371.1113 23.4638 80.8558 265.9365 16.1217 12.4399 7.5341 21.8678 11.1036 9.8763 7.4018 7.9046 5.5999 0.2306 71.3225 45.2795
temp: 298.150 k
press: 1.00000 atm
elementType: 8 8 8 8 6 6 6 6 6 6 6 6 6 6 6 6 6 6 6 1 1 1 1 1 1 1 1 1 1 1 1
symmnumber: 1
zpe: 612110.1 jmol-1
zpe.correction: 0.233140 hartree
zpe.thermalcorrener: 0.248932 hartree
zpe.thermalcorrenthalpy: 0.249876 hartree
zpe.thermalcorrgfe: 0.188765 hartree
zpe.sumelectzpe: -878.350611 hartree
zpe.sumelectthermal: -878.334820 hartree
zpe.sumelectthermalent: -878.333876 hartree
zpe.sumelectthermalfe: -878.394987 hartree
dipole: 0.6002 -2.3010 -0.9883
dipole: 2.5752
quadrupole: -83.4134 -124.7687 -103.8782
quadrupole: -3.5482 9.3073 7.1586
quadrupole: 20.6067 -20.7486 0.1419 -3.5482 9.3073 7.1586
hfenergy: -878.5837519 hartree
pointgroup: C01[X(C15H12O4)]
dipole: 0.229336 -0.8139491 -0.5580089 debye
polarizability: 269.8757521|-7.7988469|160.175947|-0.2477937|19.8886346|116.1097955 unknown
InChI: InChI=1S/C15H12O4/c16-10-3-1-9(2-4-10)14-8-13(18)12-6-5-11(17)7-15(12)19-14/h1-7,14,16-17H,8H2
charge 0 multiplicity 1
31 atoms
O  0.315507 -0.687806 -0.058725
O  1.853081 3.215984 0.299996
O  4.674686 -2.6032 -0.367444
O  -6.077449 -0.736355 -0.35221
C  -0.515953 0.41485 0.537759
C  -0.08836 1.768229 -0.067282
C  -1.966405 0.066109 0.290172
C  1.404275 2.040118 0.149332
C  2.266041 0.838269 0.107333
C  1.695581 -0.465653 -0.050003
C  -2.922077 0.197087 1.328083
C  -2.402711 -0.353488 -0.990335
C  3.681845 0.957955 0.127435
C  2.513041 -1.601379 -0.214033
C  3.912563 -1.441368 -0.203979
C  4.511308 -0.16016 -0.023408
C  -4.287051 -0.065984 1.09879
C  -3.762842 -0.633213 -1.232324
C  -4.706058 -0.481632 -0.185448
H  -0.303088 0.418973 1.627249
H  -0.678768 2.590691 0.37138
H  -0.291894 1.761562 -1.157436
H  -2.599521 0.50734 2.329444
H  -1.669508 -0.49085 -1.792024
H  4.100645 1.962915 0.245875
H  2.069748 -2.592899 -0.329343
H  5.602929 -0.053294 -0.01281
H  -5.031724 0.033834 1.893497
H  -4.086945 -0.969528 -2.225918
H  5.643005 -2.402005 -0.332165
H  -6.274102 -1.027603 -1.277059
