program: Gaussian 09
title: 000114743
version: EM64L-G09RevD.01
frameworkgroup: C1[X(C16H15Cl2N)]
method: RPBEPBE
basis: SDD
operation: Freq
keyword: #p
keyword: freq=noraman
keyword: PBEPBE/SDD
title: #p freq=noraman PBEPBE/SDD
converged: YES YES NO NO
title: Mulliken charges:
elementType: Cl Cl N C C C C C C C C C C C C C C C C H H H H H H H H H H H H H H H
charge: -0.022289 -0.013747 -0.622032 -0.352371 -0.436061 -0.464059 -0.270735 0.201342 0.318247 0.576976 -0.367965 -0.402530 -0.342412 -0.494280 -0.248795 -0.258061 -0.088070 -0.195881 -0.130602 0.232108 0.251571 0.216005 0.210663 0.202862 0.217705 0.246169 0.240499 0.266719 0.286959 0.284144 0.244068 0.229329 0.228628 0.255895
chargesum: 0.00000
title: Mulliken charges with hydrogens summed into heavy atoms:
elementType: Cl Cl N C C C C C C C C C C C C C C C C
charge: -0.022289 -0.013747 -0.068354 -0.120263 0.031515 -0.050534 -0.053030 0.201342 0.318247 0.576976 -0.121795 -0.162031 -0.058268 -0.250212 -0.019466 -0.029432 -0.088070 0.060014 -0.130602
polarizability: 2.47079535e+02 -1.81121566e+00 1.66190998e+02 1.23949429e+01 6.92654127e+00 1.63886686e+02
1716.lowfreq: -7.6719 -3.4286 -0.0021 -0.0004 0.0008 6.1516 20.2998 28.6688 42.6050
frequency: 20.0844 28.6424 42.6001 93.2094 113.8314 125.2976 174.4184 182.1071 193.0210 220.1075 243.7384 260.2948 305.7508 332.2069 346.5460 373.0536 386.4769 409.2859 433.1526 448.8452 460.1652 475.0615 513.9021 549.3564 586.9964 589.3771 616.1238 651.9800 660.7874 693.5820 711.4486 744.1352 765.0746 786.7986 807.0901 823.0865 858.7297 882.2771 886.5194 907.4848 918.3146 954.3193 956.4052 976.9176 991.2699 1003.0760 1011.5759 1041.7666 1060.4385 1087.1355 1113.5687 1116.8755 1139.2140 1143.8088 1170.9444 1176.2380 1184.7483 1199.4120 1217.2101 1226.8050 1245.0140 1269.7119 1277.7375 1301.8272 1318.0747 1341.4897 1352.3283 1370.6986 1372.3671 1384.3710 1391.6868 1439.1114 1456.0426 1461.9785 1466.8126 1484.9452 1568.1846 1587.2730 1593.3391 1610.6447 1629.7559 2876.8585 2947.1501 2981.3402 3001.5625 3036.0055 3064.6926 3107.5273 3120.6564 3133.8362 3137.6417 3151.5215 3159.0644 3167.7200 3439.0621 3573.1070
redmass: 7.4940 4.9883 6.8054 4.5283 4.3141 5.1294 5.8357 12.7974 5.5697 4.0870 2.3383 1.4130 4.1363 4.1700 3.3984 3.1482 4.9830 4.9058 4.4507 3.3910 4.8027 4.3029 3.5351 3.1276 2.6013 1.9466 4.4501 4.0101 5.4478 4.3017 3.2948 2.0223 3.7896 1.9013 2.8726 1.4140 2.4918 1.5505 1.8760 2.1251 2.3959 1.3645 1.4227 2.2419 1.3322 5.2245 2.2828 2.2604 1.9549 2.5244 1.8790 1.9849 1.6325 1.3054 1.3647 1.1417 1.9996 1.8627 1.7004 1.4902 1.2971 1.4571 1.9681 1.4854 1.2778 1.4933 1.4661 6.3536 2.5184 2.7538 2.4364 2.2806 2.3780 1.1733 1.1055 2.4723 7.4999 7.0161 6.8059 5.5849 1.1224 1.0824 1.0823 1.0603 1.0615 1.1012 1.1027 1.0878 1.0875 1.0896 1.0928 1.0923 1.1004 1.0956 1.0448 1.0977
irintensity: 0.0748 0.1713 0.0131 0.6290 0.4435 0.0528 1.8159 0.5043 1.2225 1.5539 9.7403 22.3747 7.5536 2.6946 1.5383 0.1049 1.5587 1.6833 2.4668 6.4868 14.5223 18.1054 2.9976 9.4098 62.8623 68.3079 5.4750 32.1443 1.6870 24.7976 10.3761 43.1749 9.6513 29.9260 5.0799 36.5191 8.6713 3.1167 4.3148 8.4205 7.5952 0.2943 3.4918 14.4497 0.6218 35.8968 6.8252 5.4222 1.5779 11.5535 7.5971 28.3301 11.4390 1.5593 8.5996 1.8720 5.6784 1.7880 4.5050 10.0443 2.4902 1.6492 3.1978 8.7274 7.5461 2.0394 9.8243 1.2924 3.1603 3.8566 23.9895 6.4720 63.9349 35.0828 6.0269 25.6403 13.4445 2.4372 3.5444 2.9139 54.7125 90.7235 17.4516 61.8345 34.3962 46.6360 22.9709 13.5357 3.1024 8.3296 25.4758 0.2561 31.2702 4.2373 2.0332 0.3123
temp: 298.150 k
press: 1.00000 atm
elementType: 17 17 7 6 6 6 6 6 6 6 6 6 6 6 6 6 6 6 6 1 1 1 1 1 1 1 1 1 1 1 1 1 1 1
symmnumber: 1
zpe: 701094.4 jmol-1
zpe.correction: 0.267033 hartree
zpe.thermalcorrener: 0.283804 hartree
zpe.thermalcorrenthalpy: 0.284748 hartree
zpe.thermalcorrgfe: 0.220899 hartree
zpe.sumelectzpe: -1592.220540 hartree
zpe.sumelectthermal: -1592.203769 hartree
zpe.sumelectthermalent: -1592.202825 hartree
zpe.sumelectthermalfe: -1592.266674 hartree
dipole: 4.3058 -1.1597 -1.3023
dipole: 4.6456
quadrupole: -125.1087 -119.8195 -119.4274
quadrupole: -0.4365 12.1366 0.4984
quadrupole: -3.6568 1.6324 2.0245 -0.4365 12.1366 0.4984
hfenergy: -1592.487573 hartree
pointgroup: C01 [X(C16H15Cl2N1)]
dipole: 1.6320528 0.349361 0.7448982 debye
polarizability: 247.3945361|9.9113129|162.4507143|-6.1431638|6.1985261|167.3119698 unknown
InChI: InChI=1S/C16H15Cl2N/c17-14-7-5-10(9-15(14)18)11-6-8-16(19)13-4-2-1-3-12(11)13/h1-5,7,9,11,16H,6,8,19H2
charge 0 multiplicity 1
34 atoms
Cl -3.22652 -0.084081 -2.707415
Cl -5.495994 -0.462433 -0.353538
N  2.673133 2.014652 -1.517959
C  0.425562 0.552736 1.111528
C  0.756136 2.040399 0.798582
C  2.26652 2.314966 0.906809
C  3.026548 1.500804 -0.165832
C  1.422982 -0.422578 0.459337
C  2.656679 0.019019 -0.094188
C  -1.030942 0.256042 0.750966
C  1.141408 -1.813782 0.47349
C  3.568183 -0.934117 -0.61525
C  -1.428738 0.199437 -0.609216
C  -2.018508 0.089728 1.75173
C  2.049314 -2.754406 -0.054173
C  3.275882 -2.313589 -0.603552
C  -2.775269 -0.018962 -0.951009
C  -3.371939 -0.126905 1.411005
C  -3.752553 -0.180943 0.055792
H  0.524817 0.416288 2.210294
H  0.442654 2.278661 -0.233916
H  0.180788 2.689237 1.484797
H  2.468295 3.394806 0.765229
H  2.645228 2.038896 1.911426
H  4.121656 1.584597 0.037468
H  0.192061 -2.159643 0.899732
H  4.525394 -0.584041 -1.023731
H  3.017871 2.964062 -1.701065
H  2.898944 1.366464 -2.279557
H  -0.684048 0.318262 -1.403134
H  -1.733369 0.13008 2.809298
H  1.805658 -3.822497 -0.033543
H  3.993412 -3.03542 -1.009061
H  -4.132645 -0.255541 2.186656
