program: Gaussian 09
title: 000114683
version: EM64L-G09RevD.01
frameworkgroup: C1[X(C8H7NO2)]
method: RPBEPBE
basis: SDD
operation: Freq
keyword: #pfreq=noraman
keyword: PBEPBE/SDD
title: #p freq=noraman PBEPBE/SDD
converged: NO NO NO NO
title: Mulliken charges:
elementType: O O N C C C C C C C C H H H H H H H
charge: -0.440597 -0.499037 -0.411598 0.258637 0.330466 -0.456815 -0.539376 -0.397591 0.179363 0.160488 -0.234105 0.252990 0.232693 0.305609 0.253410 0.252518 0.382566 0.370378
chargesum: 0.00000
title: Mulliken charges with hydrogens summed into heavy atoms:
elementType: O O N C C C C C C C C
charge: -0.058031 -0.128658 -0.105988 0.258637 0.330466 -0.203825 -0.306683 -0.144181 0.179363 0.160488 0.018413
polarizability: 1.54372661e+02 5.35276789e-01 1.03045706e+02 -1.38916124e-03 -2.42717365e-04 4.03953911e+01
1716.lowfreq: -8.6232 -7.7430 -0.0008 -0.0006 -0.0005 6.2365 148.5304 148.9001 240.8472
frequency: 148.5297 148.8998 240.8424 290.5762 314.8009 329.0037 356.7807 410.0856 419.4399 457.8877 483.2035 501.4472 599.6412 612.4441 666.9042 716.9842 732.8347 748.5714 751.6620 824.0853 828.2660 839.3201 854.2614 889.4791 1055.0470 1065.1985 1096.2321 1146.3979 1154.2476 1187.5659 1228.8347 1261.9958 1312.8522 1362.4986 1374.9774 1429.3185 1481.4021 1516.9930 1518.3465 1604.6079 1653.4298 3124.2827 3166.3315 3210.8155 3238.3166 3519.9047 3615.2602 3626.9542
redmass: 5.6506 6.0460 1.1012 5.1174 4.6345 4.9662 7.6411 2.7039 5.7676 7.9813 1.1042 1.2755 2.7444 4.7109 5.7760 1.7215 6.9266 6.5221 1.8607 1.4663 3.6138 1.5522 1.4153 3.9067 2.6355 1.6306 1.5459 1.5001 1.3693 2.1414 1.7774 1.6423 2.4007 2.0622 5.5975 3.1148 4.7068 5.4625 4.0846 6.1958 7.7796 1.0920 1.0929 1.0909 1.1063 1.0647 1.0809 1.0666
irintensity: 4.0029 5.2052 170.2072 7.8037 12.1346 2.4546 9.1305 23.4325 4.6201 3.2885 105.3348 116.6431 5.9206 19.6933 5.4611 52.0619 7.0013 2.8237 26.0802 40.1208 55.4735 16.9289 41.1116 7.3277 31.4310 49.8772 178.9583 51.1020 97.9645 17.6481 10.7590 179.4094 92.6818 9.0843 12.2464 69.5595 32.2246 20.7339 23.2935 30.0506 9.3562 13.5626 3.3883 2.4085 3.8465 99.5708 58.3044 44.4105
temp: 298.150 k
press: 1.00000 atm
elementType: 8 8 7 6 6 6 6 6 6 6 6 1 1 1 1 1 1 1
symmnumber: 1
zpe: 353602.7 jmol-1
zpe.correction: 0.134680 hartree
zpe.thermalcorrener: 0.143573 hartree
zpe.thermalcorrenthalpy: 0.144517 hartree
zpe.thermalcorrgfe: 0.101365 hartree
zpe.sumelectzpe: -513.468252 hartree
zpe.sumelectthermal: -513.459359 hartree
zpe.sumelectthermalent: -513.458415 hartree
zpe.sumelectthermalfe: -513.501567 hartree
dipole: -1.5147 1.3405 0.0007
dipole: 2.0227
quadrupole: -53.4760 -51.8857 -69.1282
quadrupole: 12.7744 0.0016 0.0008
quadrupole: 4.6873 6.2776 -10.9649 12.7744 0.0016 0.0008
hfenergy: -513.6029321 hartree
pointgroup: C01 [X(C8H7N1O2)]
dipole: 0.6103615 -0.5106062 0.0002635 debye
dipolederiv: -1.3934468 0.3888213 -0.0000014 0.5791522 -0.3352573 0.0000021 -0.0000019 -0.0000058 -0.4200198 -1.2307959 -0.4782146 0.0000256 -0.6211226 -0.4098216 -0.0001148 -0.0000876 -0.000146 -0.4408113 -0.388117 0.1023147 0.0000047 -0.2468486 -0.5624452 0.0000065 0.0000191 0.0000327 -0.2830346 0.3704059 0.0658252 -0.0000045 0.4431624 0.0698552 0.0000018 0.0000085 -0.0000144 0.0097049 0.1054016 0.0610741 0.0000049 -0.2746584 -0.171026 -0.0000079 -0.0000003 -0.0000065 0.0238213 -0.1262948 0.0460005 0.0000105 -0.1058173 0.0120156 0.0000067 0.0000035 -0.0000019 -0.2045274 0.0121592 -0.0567833 0.0000042 0.0485282 0.0192097 0.0000109 -0.000011 0.0000161 -0.2038028 -0.0283769 -0.1782691 0.0000044 -0.0289278 -0.1035184 0.0000062 0.0000015 0.0000057 -0.2914875 1.071325 -0.3151923 -0.0000001 -0.8374054 0.2198282 -0.0000055 0.0000129 0.0000174 0.0512237 0.7573818 0.4162177 0.0000062 0.9796516 0.2781083 0.0000501 0.0000429 0.0000364 0.0019306 -0.2710453 -0.1373834 -0.0000029 -0.0368315 0.5378395 0.0000005 -0.0000179 -0.0000015 -0.1876339 0.0847152 -0.0073099 -0.0000016 0.017318 -0.0572459 -0.0000047 -0.000004 -0.0000001 0.1929989 0.0653612 -0.024166 0.0000002 -0.0460938 -0.1093428 -0.0000089 -0.0000034 -0.0000115 0.1830832 0.184597 0.0385806 -0.000002 0.0413048 0.1783628 -0.0000052 -0.0000106 -0.0000171 0.3489343 0.0538343 0.0438534 -0.0000019 0.090286 -0.0331513 -0.000003 0.0000004 -0.0000038 0.2026318 -0.0499605 -0.0200714 -0.0000035 -0.0390135 0.0959304 -0.0000016 0.0000003 -0.0000009 0.2212249 0.4325742 -0.1060175 0.0000034 -0.0766649 0.2360825 -0.0000073 0.0000167 0.0000025 0.3904528 0.350282 0.1607199 -0.0000463 0.1139805 0.1345762 0.0000739 0.0000308 0.0000989 0.4053111 unknown
polarizability: 154.3032315|1.9609508|103.1151359|0.0013819|0.0002812|40.3953911 unknown
InChI: InChI=1S/C8H7NO2/c10-7-3-5-1-2-9-6(5)4-8(7)11/h1-4,9-11H
charge 0 multiplicity 1
18 atoms
O  -2.761767 1.359263 -0.00012
O  -2.805478 -1.307766 -0.000217
N  2.200895 1.153904 -0.000073
C  0.874926 0.702406 -0.000088
C  0.918761 -0.738395 -0.000118
C  -0.335384 1.432704 -0.00009
C  -0.305189 -1.463899 -0.000153
C  2.315057 -1.123026 -0.000096
C  -1.527191 0.693139 -0.000128
C  -1.503524 -0.740112 -0.000158
C  3.06862 0.049838 -0.000068
H  -0.382435 2.525247 -0.000071
H  -0.31072 -2.560931 -0.000189
H  2.487759 2.129765 -0.000028
H  2.715495 -2.135295 -0.000107
H  4.148693 0.184891 -0.000054
H  -3.483381 0.675919 -0.000111
H  -2.775336 -2.293552 0.000069
