program: Gaussian 09
title: 000114612
version: EM64L-G09RevD.01
frameworkgroup: C1[X(C6H8O)]
method: RPBEPBE
basis: SDD
operation: Freq
keyword: #p
keyword: freq=noraman
keyword: PBEPBE/SDD
title: #p freq=noraman PBEPBE/SDD
converged: YES YES NO NO
title: Mulliken charges:
elementType: O C C C C C C H H H H H H H H
charge: -0.305646 -0.141341 -0.140912 -0.011953 -0.012001 -0.574815 -0.574553 0.224625 0.224254 0.219267 0.219246 0.220619 0.216350 0.220692 0.216167
chargesum: 0.00000
title: Mulliken charges with hydrogens summed into heavy atoms:
elementType: O C C C C C C
charge: -0.305646 0.083285 0.083342 0.207315 0.207245 -0.137846 -0.137694
polarizability: 1.09200160e+02 -5.11026375e-02 5.35131118e+01 1.70400728e-02 4.47658678e+00 4.62900943e+01
1716.lowfreq: -0.0006 -0.0006 0.0003 7.4917 16.6402 22.1826 75.7300 112.0762 182.4821
frequency: 75.6390 112.0669 182.4597 253.8751 318.6544 335.1768 419.2255 490.2876 641.1269 707.0824 737.9098 757.5929 881.8132 929.9194 949.5758 949.9488 983.8790 990.5829 1023.7631 1054.5524 1145.8965 1187.8630 1245.1697 1270.9951 1295.4096 1321.5754 1340.4504 1438.9948 1444.4319 1651.0472 1652.5696 3075.7906 3090.5336 3093.5710 3094.5696 3124.8203 3134.0643 3204.6005 3205.3396
redmass: 2.9725 2.2489 2.4238 2.2780 2.6368 2.3641 3.2903 4.0696 2.1590 2.3784 3.1174 2.6063 2.4202 1.5012 1.3031 1.3316 1.2001 1.2255 1.1688 1.2152 1.7904 2.0386 1.6813 1.2908 1.3097 1.3158 1.7976 1.2331 1.3649 4.5600 4.6490 1.0869 1.0897 1.0611 1.0646 1.0937 1.0929 1.1142 1.1140
irintensity: 0.1818 0.0968 0.6343 3.9022 10.8505 1.6650 6.6930 9.3270 1.2929 0.5452 6.2336 52.8850 19.1488 0.1366 139.8744 33.8688 3.5332 14.7978 16.6322 0.1761 5.9960 4.0193 3.1897 0.2193 4.4399 7.4493 1.4649 25.5020 4.5007 14.0456 1.7615 4.1484 23.3724 10.4026 17.6840 0.1541 16.1101 1.9173 41.2028
temp: 298.150 k
press: 1.00000 atm
elementType: 8 6 6 6 6 6 6 1 1 1 1 1 1 1 1
symmnumber: 1
zpe: 315890.8 jmol-1
zpe.correction: 0.120316 hartree
zpe.thermalcorrener: 0.127899 hartree
zpe.thermalcorrenthalpy: 0.128843 hartree
zpe.thermalcorrgfe: 0.088401 hartree
zpe.sumelectzpe: -308.030572 hartree
zpe.sumelectthermal: -308.022989 hartree
zpe.sumelectthermalent: -308.022045 hartree
zpe.sumelectthermalfe: -308.062487 hartree
dipole: 0.0006 -1.7506 1.6296
dipole: 2.3917
quadrupole: -37.0146 -45.3417 -41.8390
quadrupole: -0.0065 -0.0040 6.3851
quadrupole: 4.3838 -3.9433 -0.4405 -0.0065 -0.0040 6.3851
hfenergy: -308.1508881 hartree
pointgroup: C01 [X(C6H8O1)]
dipole: 0.0980414 0.834621 -0.4233302 debye
dipolederiv: -0.403105 -0.0380431 0.0041915 -0.0358447 -0.7283441 0.0385071 0.0153577 0.1375263 -0.4079346 0.2435839 -0.0381355 -0.0178868 0.1648308 0.3231015 0.0113545 0.0748735 -0.0242702 0.2851783 0.2246903 0.0600371 0.0179937 -0.1431751 0.3473929 0.0020631 -0.0817238 -0.006769 0.2841824 0.1319295 0.0560113 -0.0352794 0.1682986 -0.1226783 0.1010635 0.0644871 0.0905602 0.0309587 0.0717458 -0.1001531 0.0582592 -0.2137973 -0.0628981 0.0856784 -0.0393828 0.100057 0.0289654 -0.2396045 0.0629955 -0.0604183 -0.0045252 -0.2740699 0.1946217 -0.087281 0.1889626 0.0324081 -0.2590384 -0.0715168 0.0921989 -0.0042727 -0.2571513 0.1800665 0.1166462 0.1666369 0.0355519 -0.0638743 0.0320915 0.1022598 -0.0120374 0.047444 -0.0615886 0.0371619 -0.0567349 -0.0743594 -0.0583735 -0.0068252 -0.1131077 0.0374516 0.0460302 -0.0372011 -0.0480924 -0.0476639 -0.0793787 0.0548163 -0.0061644 0.097239 -0.0107648 0.1191723 -0.0684409 0.0403153 -0.0907961 -0.0436312 0.0664355 0.0201141 -0.1064267 0.0239904 0.1118158 -0.0467568 -0.0555164 -0.0810512 -0.0472866 0.0124256 -0.078337 -0.0452853 -0.0983135 0.1139481 -0.0978377 -0.0577754 -0.1017408 0.0304446 0.0781739 -0.0171428 0.0518246 0.0065688 0.1360172 -0.1055225 0.0850119 -0.0923458 -0.052859 0.0521606 0.0949146 0.0232968 0.1151206 0.070584 -0.1021669 0.0343497 -0.1092623 0.0343167 0.0880343 0.0301538 -0.0688594 0.0064699 0.1296357 -0.0938403 -0.0984315 -0.0731087 -0.0565568 unknown
polarizability: 108.4895876|-6.3434139|51.2447332|1.5946311|5.5754253|49.2690451 unknown
InChI: InChI=1S/C6H8O/c1-3-5-6(4-2)7-5/h3-6H,1-2H2
charge 0 multiplicity 1
15 atoms
O  -0.163822 -1.473715 0.139101
C  0.725056 -0.431159 -0.526069
C  -0.78332 -0.265878 -0.550434
C  1.620041 0.339213 0.370324
C  -1.51819 0.684913 0.318293
C  2.905233 0.643312 0.053642
C  -2.699574 1.2521 -0.0383
H  1.186419 -0.789606 -1.457471
H  -1.282146 -0.519014 -1.497067
H  1.20396 0.6503 1.337087
H  -1.073056 0.909179 1.295981
H  3.543708 1.215925 0.734249
H  3.353823 0.330866 -0.897851
H  -3.221806 1.953666 0.620353
H  -3.175526 1.032499 -1.00234
