program: Gaussian 09
title: 000114567
version: EM64L-G09RevD.01
frameworkgroup: C1[X(C15H28O)]
method: RPBEPBE
basis: SDD
operation: Freq
keyword: #pfreq=noraman
keyword: PBEPBE/SDD
title: #p freq=noraman PBEPBE/SDD
converged: NO YES NO NO
title: Mulliken charges:
elementType: O C C C C C C C C C C C C C C C H H H H H H H H H H H H H H H H H H H H H H H H H H H H
charge: -0.215160 -0.004864 0.003448 -0.416544 -0.398312 -0.413775 -0.431681 -0.405341 -0.409685 -0.409236 -0.153442 -0.546864 0.206218 -0.749388 -0.754346 -0.730304 0.199227 0.225287 0.201524 0.190164 0.180557 0.188335 0.190920 0.191869 0.199877 0.199917 0.192430 0.219042 0.220036 0.194244 0.216688 0.188268 0.218304 0.238396 0.214717 0.220330 0.210037 0.208810 0.223341 0.203146 0.216517 0.225114 0.218817 0.233361
chargesum: 0.00000
title: Mulliken charges with hydrogens summed into heavy atoms:
elementType: O C C C C C C C C C C C C C C C
charge: -0.215160 0.194362 0.228735 -0.024855 -0.029420 -0.030986 -0.031887 0.006131 0.004595 -0.004280 0.064862 -0.093751 0.206218 -0.110212 -0.111341 -0.053013
polarizability: 1.72551564e+02 2.92909664e+00 1.62639945e+02 1.03220509e+00 -1.59455506e-01 1.42156864e+02
1716.lowfreq: -10.1161 -8.6959 -0.0003 0.0001 0.0005 8.3340 31.3758 38.0774 78.4128
frequency: 30.9801 37.5635 78.3319 96.3446 110.1518 138.3312 156.1444 169.4175 191.4322 206.8770 216.4285 231.6838 234.2124 254.7936 273.4573 293.1395 297.6863 310.0578 332.5896 356.9033 376.7373 399.2300 433.3302 436.8865 467.0133 490.2827 516.2239 561.4308 634.6047 698.3863 721.0043 765.0194 785.4555 804.3919 837.7055 854.4896 867.8074 881.6897 890.8480 906.2117 946.4148 953.0902 960.8922 973.0198 975.7755 1001.1715 1032.6910 1033.9238 1035.8684 1054.6103 1072.6234 1084.9839 1092.0697 1099.7887 1121.9901 1126.6754 1144.4380 1155.1435 1169.7117 1187.4908 1198.6599 1205.8745 1218.3196 1243.8793 1262.1883 1276.2924 1285.5518 1294.4375 1303.0510 1304.9719 1318.3238 1331.4704 1335.2433 1336.8223 1341.2011 1349.5164 1351.2171 1355.7419 1358.6437 1359.6860 1382.8205 1385.4213 1387.8457 1435.8086 1448.4122 1449.6706 1460.9047 1463.7122 1468.5316 1472.8300 1474.4585 1475.8725 1479.4931 1479.7842 1481.5535 1485.0049 1485.5014 1617.4209 2949.4984 2959.8072 2962.8560 2964.7895 2967.1041 2967.4326 2970.1527 2977.3159 2978.5713 2980.1461 2981.2073 2989.5450 2995.5564 3000.2955 3008.2555 3011.6858 3026.3161 3030.6387 3034.3009 3034.5867 3041.4359 3051.2770 3059.4986 3061.5870 3068.8556 3072.3948 3075.1179 3083.0329
redmass: 3.2607 3.8323 2.9636 4.0136 2.8530 2.9650 3.5763 2.3751 2.1174 1.4092 1.5024 1.1231 1.4893 2.4559 2.3177 1.9888 2.0139 2.3158 2.3796 2.5688 2.2436 1.9792 2.4126 2.4039 1.9958 2.8036 2.5646 3.0915 2.2310 1.7198 2.1179 2.3248 2.5089 1.7807 2.0689 1.6470 1.9558 1.6622 1.6508 1.7381 1.6671 1.7424 1.7638 1.9700 1.6311 2.3473 1.6311 2.3705 1.7060 1.8150 1.6957 2.1704 2.0986 1.6502 2.1313 2.1144 1.9976 2.1761 1.3794 1.4615 1.4649 1.3147 1.3585 1.3682 1.3131 1.2679 1.2537 1.2609 1.3157 1.2897 1.2866 1.3018 1.3937 1.4483 1.4724 1.4449 1.4316 1.4150 1.3784 1.4335 1.2142 1.2114 1.2124 1.0885 1.0878 1.0867 1.0745 1.0735 1.0795 1.0471 1.0632 1.0655 1.0623 1.0613 1.0627 1.0679 1.0639 7.7598 1.0598 1.0619 1.0639 1.0585 1.0376 1.0406 1.0617 1.0387 1.0617 1.0676 1.0639 1.0815 1.0779 1.0830 1.0975 1.0950 1.0969 1.0965 1.0974 1.0964 1.1001 1.0960 1.0985 1.0980 1.0983 1.0992 1.0998 1.1006
irintensity: 0.4433 1.8580 0.1617 3.3800 0.1551 0.0202 0.4038 1.5959 1.0335 0.2636 0.2239 0.1701 0.3646 0.6547 2.7034 1.4901 0.8406 2.6852 0.4316 1.4991 0.6491 0.5103 0.7150 0.2855 0.4441 2.7046 0.2319 3.5554 0.2667 3.2152 10.5102 2.2462 1.3236 5.9174 0.7367 3.1632 4.4665 2.3432 4.3763 0.4746 3.6144 6.6313 2.1510 3.5089 15.1592 22.1915 7.7677 5.1951 5.6744 6.1148 3.0100 2.4827 5.9713 3.9961 7.4680 4.9061 22.3981 3.1199 0.5510 6.2816 1.2323 6.7320 3.2882 2.3037 8.6992 2.0824 3.9227 1.6429 3.9158 0.7456 3.9598 1.4140 4.7730 6.7930 11.8623 0.2450 1.0756 1.3456 2.6912 4.5878 15.1563 10.9436 22.0707 17.1515 9.5884 13.5881 5.4148 4.7505 6.1814 18.8759 5.9599 11.0884 0.3007 16.6397 20.9720 19.5982 9.7439 57.0476 32.5503 13.0828 16.9483 42.9299 14.2063 54.1241 20.9610 25.5860 62.9526 56.9949 9.2621 15.1597 36.0637 10.8910 4.9245 55.3320 87.7109 34.5867 55.2460 28.7101 50.0897 45.5316 65.2729 53.2505 41.8187 45.9401 37.9718 34.1031
temp: 298.150 k
press: 1.00000 atm
elementType: 8 6 6 6 6 6 6 6 6 6 6 6 6 6 6 6 1 1 1 1 1 1 1 1 1 1 1 1 1 1 1 1 1 1 1 1 1 1 1 1 1 1 1 1
symmnumber: 1
zpe: 1048150.3 jmol-1
zpe.correction: 0.399219 hartree
zpe.thermalcorrener: 0.417517 hartree
zpe.thermalcorrenthalpy: 0.418461 hartree
zpe.thermalcorrgfe: 0.354009 hartree
zpe.sumelectzpe: -662.300797 hartree
zpe.sumelectthermal: -662.282499 hartree
zpe.sumelectthermalent: -662.281555 hartree
zpe.sumelectthermalfe: -662.346008 hartree
dipole: 0.1440 1.0744 2.3038
dipole: 2.5460
quadrupole: -99.7162 -104.7875 -103.7832
quadrupole: 1.6905 3.2431 -6.0577
quadrupole: 3.0461 -2.0252 -1.0209 1.6905 3.2431 -6.0577
hfenergy: -662.7000164 hartree
pointgroup: C01 [X(C15H28O1)]
dipole: -0.0019668 0.4173465 -0.9106018 debye
polarizability: 171.8130182|-3.8741878|163.3481898|1.4273362|-0.2017873|142.1871649 unknown
InChI: InChI=1S/C15H28O/c1-12-6-4-7-13(2)10-11-15(16)14(3)9-5-8-12/h12-14H,4-11H2,1-3H3
charge 0 multiplicity 1
44 atoms
O  -1.427575 -1.814915 1.123276
C  0.49027 2.053681 -0.310512
C  1.799911 -1.469736 0.234447
C  1.697996 1.708468 0.604382
C  -0.722568 2.572753 0.518754
C  2.422055 -0.424767 -0.736724
C  2.849267 0.912319 -0.071265
C  -1.453917 1.523387 1.405052
C  0.885533 -2.494806 -0.493715
C  -2.639213 0.774565 0.738847
C  -2.297789 -0.160691 -0.449989
C  -0.405456 -1.883203 -1.090506
C  -1.364303 -1.314218 -0.0335
C  0.881623 3.08901 -1.392223
C  2.902754 -2.209983 1.027664
C  -3.595954 -0.791246 -1.039942
H  0.174898 1.126369 -0.827362
H  1.161834 -0.938091 0.967452
H  1.336756 1.141751 1.484434
H  2.112319 2.657437 1.005914
H  -1.461663 3.031478 -0.172086
H  -0.356574 3.400339 1.162403
H  1.714653 -0.198937 -1.558521
H  3.309428 -0.881038 -1.223295
H  3.626794 0.711359 0.693523
H  3.336769 1.546574 -0.838696
H  -1.864342 2.039375 2.295679
H  -0.734451 0.780886 1.800948
H  0.590848 -3.278646 0.229611
H  1.456805 -2.992892 -1.303871
H  -3.137498 0.158011 1.512412
H  -3.384069 1.517207 0.385294
H  -1.808887 0.414885 -1.259276
H  -0.962135 -2.676672 -1.634989
H  -0.180209 -1.105185 -1.843358
H  1.73604 2.746414 -2.004138
H  0.03646 3.290512 -2.077318
H  1.168994 4.050322 -0.923034
H  2.464575 -2.875756 1.793855
H  3.521761 -2.830499 0.350204
H  3.577208 -1.501436 1.543192
H  -4.288967 0.006824 -1.362864
H  -3.386451 -1.434302 -1.914401
H  -4.10623 -1.402308 -0.273458
