program: Gaussian 09
title: 000114532
version: EM64L-G09RevD.01
frameworkgroup: C1[X(C14H24N2)]
method: RPBEPBE
basis: SDD
operation: Freq
keyword: #pfreq=noraman
keyword: PBEPBE/SDD
title: #p freq=noraman PBEPBE/SDD
converged: YES YES NO NO
title: Mulliken charges:
elementType: N N C C C C C C C C C C C C C C H H H H H H H H H H H H H H H H H H H H H H H H
charge: -0.439754 -0.439555 -0.030631 -0.030656 0.266223 0.266183 -0.389037 -0.389085 -0.712454 -0.712530 -0.344061 -0.344025 -0.683871 -0.683920 -0.273820 -0.273867 0.201610 0.201563 0.201057 0.184335 0.201050 0.184340 0.265041 0.264963 0.211200 0.204733 0.246379 0.211213 0.204739 0.246438 0.228662 0.228672 0.225474 0.211749 0.210595 0.225555 0.211746 0.210567 0.216582 0.216597
chargesum: 0.00000
title: Mulliken charges with hydrogens summed into heavy atoms:
elementType: N N C C C C C C C C C C C C C C
charge: -0.174713 -0.174591 0.170980 0.170907 0.266223 0.266183 -0.003645 -0.003695 -0.050142 -0.050140 -0.115399 -0.115353 -0.036053 -0.036052 -0.057238 -0.057270
polarizability: 1.95398862e+02 5.44965550e-03 1.98508843e+02 -6.21582091e+00 1.65027449e-02 1.21325108e+02
1716.lowfreq: -10.8958 -4.2018 -0.0005 -0.0002 -0.0001 9.7591 35.4242 42.2009 56.2561
frequency: 35.2482 42.1646 56.2527 67.6536 98.7677 112.3045 118.8583 148.7075 168.6799 185.1562 204.5065 213.0381 216.8947 224.9245 235.5980 283.0341 303.7365 345.1951 359.5539 397.9846 401.9865 425.1720 452.5710 491.5714 499.3016 548.3429 563.0408 598.0314 609.6920 659.4755 728.2199 733.6029 765.3374 781.1653 808.1196 825.6507 830.9368 841.3027 845.9499 898.0983 932.3611 932.7626 946.1338 974.6325 974.8641 1005.5497 1008.7504 1038.3354 1039.2217 1049.4630 1087.5954 1105.5749 1106.0402 1159.2020 1159.4963 1167.4411 1175.9399 1177.4522 1217.9481 1253.2860 1261.5378 1292.0771 1293.6794 1303.7172 1309.1648 1330.0337 1334.3274 1341.3931 1341.4767 1380.3098 1381.9809 1385.8411 1385.9546 1390.1771 1436.4152 1452.9515 1454.8803 1463.7888 1464.5826 1470.5786 1471.1781 1478.3468 1479.0549 1479.3467 1480.2966 1487.4324 1487.5126 1512.6366 1593.9804 1610.7844 2958.5863 2958.6295 2973.4024 2973.5082 2978.9684 2979.0119 2997.3175 2997.4808 3025.5125 3025.6817 3066.4489 3066.4651 3073.2613 3073.5558 3081.5624 3081.7871 3085.3063 3085.5032 3124.2436 3137.6129 3150.7354 3164.8547 3436.9023 3443.6480
redmass: 2.9292 3.0505 3.4939 3.6090 2.5789 2.0046 2.0931 2.2874 3.1763 2.0898 1.6300 1.1652 1.0800 1.6778 1.5073 3.1583 2.8717 2.4415 2.7969 2.6920 2.9373 1.7147 2.9717 2.8296 2.9104 3.0288 3.2001 5.9288 4.0110 1.4596 4.0359 1.2408 1.3090 1.2062 3.0681 1.4386 1.7869 2.8087 1.7301 1.3749 1.8339 2.0037 1.2800 1.2681 1.2498 1.6973 1.5906 3.2690 3.1279 2.0041 1.8478 2.4369 2.4131 2.1676 1.7388 1.2992 2.1163 1.6168 1.7925 1.2515 1.4216 1.3027 1.3260 2.3748 1.4032 1.3837 1.3140 1.5296 1.4860 1.3494 1.2100 1.2250 1.2167 2.2208 1.7359 1.6759 1.3244 1.1024 1.1270 1.0463 1.0448 1.1182 1.0506 1.0592 1.2636 1.0588 1.0626 2.8971 5.0629 6.5936 1.0640 1.0639 1.0370 1.0369 1.0361 1.0362 1.0828 1.0828 1.0968 1.0967 1.0993 1.0994 1.0997 1.0996 1.0998 1.0998 1.0992 1.0991 1.0840 1.0888 1.0934 1.1001 1.0742 1.0745
irintensity: 0.3688 0.0009 0.1090 0.1338 0.0209 0.0752 0.3920 0.4188 0.0003 1.1156 1.5676 0.1185 0.0509 0.3252 0.3198 11.7006 1.1767 3.2493 0.5401 6.5018 6.4860 49.7281 3.4477 23.2017 3.4950 24.9247 2.5314 4.3761 1.1040 136.7105 8.4391 104.5776 23.9965 14.8483 0.8441 2.8546 4.4837 1.9964 4.5974 3.9953 3.8007 0.7766 0.1799 2.4912 25.1794 35.8910 15.9683 4.5005 4.7732 17.9265 0.9499 19.2723 16.0651 0.7028 16.3611 1.2857 77.7346 10.7422 18.1114 2.2507 38.1986 5.5602 21.7907 107.8231 7.6678 0.0154 6.4607 0.7863 6.8196 2.9226 24.0189 16.1211 37.2536 1.6501 150.4071 3.1621 13.5134 1.3720 3.9071 8.0976 6.0408 20.0148 8.0018 32.1932 24.8682 19.4009 1.7022 177.2197 16.5352 90.7362 29.8238 22.6554 68.7038 2.2524 48.6050 14.2105 19.4797 25.8977 48.6132 0.5467 19.4621 39.9841 34.0250 87.0024 83.7157 3.6300 50.7836 50.4922 0.6906 21.0757 52.5344 17.1751 8.9652 2.7722
temp: 298.150 k
press: 1.00000 atm
elementType: 7 7 6 6 6 6 6 6 6 6 6 6 6 6 6 6 1 1 1 1 1 1 1 1 1 1 1 1 1 1 1 1 1 1 1 1 1 1 1 1
symmnumber: 1
zpe: 927903.2 jmol-1
zpe.correction: 0.353420 hartree
zpe.thermalcorrener: 0.371838 hartree
zpe.thermalcorrenthalpy: 0.372782 hartree
zpe.thermalcorrgfe: 0.307052 hartree
zpe.sumelectzpe: -656.135540 hartree
zpe.sumelectthermal: -656.117121 hartree
zpe.sumelectthermalent: -656.116177 hartree
zpe.sumelectthermalfe: -656.181908 hartree
dipole: 0.0018 -2.4743 0.0010
dipole: 2.4743
quadrupole: -88.5234 -99.2777 -105.1019
quadrupole: -0.0060 -1.2712 0.0049
quadrupole: 9.1110 -1.6434 -7.4676 -0.0060 -1.2712 0.0049
hfenergy: -656.4889593 hartree
pointgroup: C01 [X(C14H24N2)]
dipole: 0.0057934 -0.9734388 0.0007798 debye
polarizability: 195.2350456|-0.0143409|198.5087828|-7.123631|-0.0518257|121.4889844 unknown
InChI: InChI=1S/C14H24N2/c1-5-11(3)15-13-9-7-8-10-14(13)16-12(4)6-2/h7-12,15-16H,5-6H2,1-4H3
charge 0 multiplicity 1
40 atoms
N  1.362685 -0.47453 -0.095256
N  -1.355966 -0.488533 0.093814
C  2.829575 -0.625429 -0.199097
C  -2.821058 -0.654002 0.200472
C  0.716975 0.785545 -0.04494
C  -0.723184 0.778178 0.043593
C  3.230501 -2.053721 0.249605
C  -3.208626 -2.086052 -0.247751
C  3.36177 -0.32238 -1.626317
C  -3.353376 -0.356373 1.628822
C  1.401472 2.025022 -0.044289
C  -1.420487 2.010503 0.0432
C  2.957901 -2.334953 1.741435
C  -2.937098 -2.363762 -1.740451
C  0.688947 3.248186 -0.009511
C  -0.720656 3.240966 0.008417
H  3.279374 0.093189 0.513976
H  -3.2794 0.060173 -0.511642
H  4.306708 -2.196399 0.030146
H  2.687218 -2.789589 -0.381292
H  -4.282771 -2.239642 -0.025565
H  -2.656268 -2.816663 0.381369
H  0.834569 -1.189698 -0.611495
H  -0.819923 -1.198327 0.60937
H  4.46771 -0.314724 -1.642766
H  3.017033 -1.096201 -2.339003
H  3.003249 0.656668 -1.989016
H  -4.459301 -0.359211 1.647511
H  -2.999828 -1.126979 2.340675
H  -3.003419 0.625974 1.990953
H  2.494663 2.045135 -0.09463
H  -2.513815 2.019281 0.093757
H  1.897289 -2.146458 1.986294
H  3.196373 -3.38214 2.003422
H  3.570389 -1.676783 2.385826
H  -1.879061 -2.164638 -1.988011
H  -3.165895 -3.413109 -2.002432
H  -3.557781 -1.711339 -2.382848
H  1.239515 4.195263 -0.013503
H  -1.280901 4.182346 0.012363
