program: Gaussian 09
title: 000114531
version: EM64L-G09RevD.01
frameworkgroup: C1[X(C12H16O2)]
method: RPBEPBE
basis: SDD
operation: Freq
keyword: #pfreq=noraman
keyword: PBEPBE/SDD
title: #p freq=noraman PBEPBE/SDD
converged: NO YES NO NO
title: Mulliken charges:
elementType: O O C C C C C C C C C C C C H H H H H H H H H H H H H H H H
charge: -0.241355 -0.291333 -0.431423 -0.408766 -0.067011 -0.384849 -0.310742 0.359349 -0.332666 -0.390619 0.436563 -0.388652 -0.361626 -0.809537 0.222528 0.205664 0.224670 0.218995 0.242315 0.207778 0.203037 0.217820 0.213523 0.288415 0.245512 0.226121 0.228632 0.232537 0.223082 0.222037
chargesum: 0.00000
title: Mulliken charges with hydrogens summed into heavy atoms:
elementType: O O C C C C C C C C C C C C
charge: -0.241355 -0.291333 -0.003232 0.034899 0.175304 0.025966 0.120601 0.359349 -0.044252 -0.145107 0.436563 -0.162531 -0.132994 -0.131881
polarizability: 1.86220976e+02 -2.70200579e+00 1.21314512e+02 -4.31084623e+00 -8.55921190e+00 9.37784299e+01
1716.lowfreq: -5.2619 -0.0004 0.0007 0.0007 3.5607 23.7918 34.1356 41.3340 59.9283
frequency: 34.1246 40.8496 58.1776 90.6875 115.0411 174.8998 197.6388 249.1104 300.9718 329.5017 348.0847 370.9184 412.2252 432.6424 450.7411 505.9090 516.0080 565.5458 623.5673 653.2406 710.2360 738.1255 774.0555 796.5688 821.6290 828.2396 830.7917 849.6934 880.6120 891.3605 934.4102 940.1937 960.9303 984.5994 1006.7759 1011.2323 1019.4004 1045.9496 1053.0928 1107.3437 1116.8799 1120.5898 1171.8290 1176.5803 1185.7252 1207.2213 1223.1437 1252.3974 1270.5724 1304.8786 1311.0371 1333.9850 1343.7936 1349.6223 1355.8209 1365.6302 1371.3477 1396.7763 1412.8101 1446.3119 1456.8409 1462.1924 1473.3832 1474.3700 1476.5370 1499.6670 1586.9411 1622.9326 2971.5424 2984.9477 2991.4030 2998.3231 3001.0851 3025.1152 3044.9911 3051.6825 3059.6117 3073.1030 3080.5796 3089.2272 3121.3804 3124.1616 3160.6049 3173.0357
redmass: 1.0725 3.2791 3.8082 3.6890 3.9034 3.7850 3.1164 3.0053 2.6726 3.3498 2.1092 3.2427 2.9719 3.8454 4.0865 2.4401 2.4366 4.8890 4.6119 4.5937 3.1383 3.6581 4.0040 2.7033 1.5403 1.9254 1.3778 2.9261 2.6839 3.1259 1.5756 1.3367 1.3587 1.4083 2.8032 2.5685 2.5557 1.5339 1.8702 1.9180 1.8808 1.3531 1.4092 1.4126 1.3505 2.0639 3.8677 1.2366 1.2168 1.2804 1.3746 1.1992 1.3851 1.5210 1.4270 1.2823 5.1581 1.2253 3.3447 1.0906 1.0882 1.0855 1.0516 1.0946 1.0934 2.6008 6.5692 6.4531 1.0386 1.0599 1.0656 1.0602 1.0652 1.0860 1.1000 1.0950 1.1009 1.1023 1.0995 1.1020 1.0899 1.0893 1.0952 1.0943
irintensity: 0.5598 0.5965 0.6431 2.2814 0.9003 0.8784 7.7907 0.5106 2.0553 2.6520 5.8283 4.6435 0.0374 7.5668 1.8568 14.7545 7.0709 9.9339 1.9295 2.9877 0.7389 10.5587 12.3645 25.2930 49.9596 17.9729 0.1673 14.3182 12.6805 278.5120 49.1063 2.8062 0.3919 0.5926 9.1859 88.0209 43.8991 15.8960 11.6216 17.5974 18.6934 21.0367 66.3086 64.4659 19.3891 134.4432 19.7924 3.8884 10.6119 0.7331 13.8998 10.1010 0.6036 5.3187 0.1539 1.9300 8.3745 7.7689 1.0860 8.4766 11.4853 9.0056 12.3284 12.9474 15.0373 158.3953 6.8754 28.7828 49.8974 37.4481 33.8640 25.8274 22.5930 50.7104 31.8984 25.7071 50.7298 40.5711 19.5445 39.7688 21.7783 20.8109 9.8444 0.8631
temp: 298.150 k
press: 1.00000 atm
elementType: 8 8 6 6 6 6 6 6 6 6 6 6 6 6 1 1 1 1 1 1 1 1 1 1 1 1 1 1 1 1
symmnumber: 1
zpe: 666174.8 jmol-1
zpe.correction: 0.253733 hartree
zpe.thermalcorrener: 0.266881 hartree
zpe.thermalcorrenthalpy: 0.267826 hartree
zpe.thermalcorrgfe: 0.212899 hartree
zpe.sumelectzpe: -616.253561 hartree
zpe.sumelectthermal: -616.240412 hartree
zpe.sumelectthermalent: -616.239468 hartree
zpe.sumelectthermalfe: -616.294394 hartree
dipole: -1.0235 0.2978 -0.1493
dipole: 1.0764
quadrupole: -70.7413 -83.1746 -82.9041
quadrupole: -1.2824 0.4677 -0.3959
quadrupole: 8.1987 -4.2346 -3.9641 -1.2824 0.4677 -0.3959
hfenergy: -616.5072937 hartree
pointgroup: C01 [X(C12H16O2)]
dipole: 0.4005067 0.1188038 0.0693296 debye
polarizability: 186.0469136|4.5034805|119.4749262|-4.4463199|11.0500857|95.7920781 unknown
InChI: InChI=1S/C12H16O2/c1-10-5-7-11(8-6-10)14-12-4-2-3-9-13-12/h5-8,12H,2-4,9H2,1H3
charge 0 multiplicity 1
30 atoms
O  1.913119 -1.235462 -0.466904
O  0.690378 0.83567 -0.108658
C  2.888423 0.970049 -1.077053
C  3.65611 1.007597 0.264852
C  1.630073 0.097097 -0.975647
C  3.93929 -0.43267 0.754458
C  2.625711 -1.226689 0.8392
C  -0.664372 0.427543 -0.088573
C  -1.139576 -0.798728 -0.61259
C  -1.563732 1.338051 0.514163
C  -3.445853 -0.186264 0.043207
C  -2.522324 -1.08549 -0.544576
C  -2.936659 1.026437 0.579359
C  -4.932689 -0.498207 0.084054
H  2.593795 1.984642 -1.398406
H  3.532198 0.534935 -1.865498
H  3.046673 1.542245 1.01796
H  4.599838 1.57019 0.143632
H  1.154029 -0.084579 -1.957498
H  4.629239 -0.940251 0.052208
H  4.424353 -0.422125 1.749652
H  2.793487 -2.293084 1.059655
H  1.95458 -0.794909 1.607799
H  -0.443392 -1.535706 -1.021477
H  -1.173034 2.276637 0.919947
H  -2.884065 -2.039129 -0.948598
H  -3.624739 1.739252 1.050203
H  -5.453214 -0.094072 -0.806359
H  -5.117783 -1.586894 0.104803
H  -5.415363 -0.055586 0.973685
