program: Gaussian 09
title: 000114529
version: EM64L-G09RevD.01
frameworkgroup: C1[X(C7H14N2O3)]
method: RPBEPBE
basis: SDD
operation: Freq
keyword: #p
keyword: freq=noraman
keyword: PBEPBE/SDD
title: #p freq=noraman PBEPBE/SDD
converged: NO YES NO NO
title: Mulliken charges:
elementType: O O O N N C C C C C C C H H H H H H H H H H H H H H
charge: -0.251113 -0.251168 -0.274286 -0.173955 -0.173986 -0.023362 -0.023269 0.237456 -0.618647 -0.618645 -0.515473 -0.515453 0.218100 0.218102 0.266387 0.217999 0.245705 0.266379 0.217953 0.245771 0.204985 0.201854 0.245910 0.245912 0.205002 0.201842
chargesum: 0.00000
title: Mulliken charges with hydrogens summed into heavy atoms:
elementType: O O O N N C C C C C C C
charge: -0.251113 -0.251168 -0.274286 -0.173955 -0.173986 0.194738 0.194833 0.237456 0.111444 0.111458 0.137276 0.137303
polarizability: 1.18230178e+02 3.75888963e-03 1.04104278e+02 1.93854786e-04 -4.06722912e+00 7.78862029e+01
1716.lowfreq: -13.7548 -8.6221 -0.0009 -0.0008 -0.0007 8.3778 45.7672 80.3801 83.3795
frequency: 45.5912 80.3346 83.2422 111.5001 121.8444 123.0632 145.8654 150.6321 152.9966 182.2409 247.7793 259.4423 278.3623 293.6176 322.3804 385.0293 415.3894 484.3271 562.5040 563.5686 698.8305 736.9101 800.7351 872.7279 907.0093 967.8748 983.7739 1011.2627 1024.0033 1062.5119 1074.3381 1109.0730 1111.7749 1126.1213 1134.1689 1146.0886 1146.1420 1193.9944 1223.7822 1288.3225 1300.2571 1301.3923 1314.8912 1365.9522 1399.9870 1427.5026 1427.7677 1433.5023 1447.9882 1459.1996 1460.3473 1470.5963 1473.5604 1475.6800 1476.7147 1494.2998 1499.7395 1680.8881 2925.2160 2928.4163 2940.3886 2940.8730 2971.7426 2973.2869 3001.1913 3002.4556 3057.0625 3057.1066 3102.2985 3102.6603 3108.9837 3109.9326
redmass: 3.1127 2.5339 2.8412 3.8118 2.5580 1.8431 1.0555 1.2032 1.2049 1.6276 2.6812 3.3015 3.8224 3.1181 4.6265 7.3439 4.6049 6.4167 5.1893 3.4981 8.3442 5.2741 5.6697 6.4683 5.0255 2.6193 5.4600 8.5531 4.7714 1.9269 2.0673 1.2658 1.2708 1.2900 1.3069 1.4022 1.3966 1.8582 1.5904 2.3573 2.9373 1.5368 1.1864 4.2999 1.8436 1.1320 1.1912 1.1443 1.4623 1.0600 1.0669 1.0566 1.0511 1.0458 1.0492 1.0593 1.1486 10.0041 1.0351 1.0384 1.0805 1.0838 1.0363 1.0368 1.1024 1.1024 1.0993 1.0993 1.0993 1.0992 1.0968 1.0969
irintensity: 0.1091 0.3546 4.6633 4.9043 7.5834 0.6670 0.2679 1.6088 3.7366 0.3728 0.6998 5.8389 0.9732 11.1094 31.2893 0.3548 0.1212 0.8710 10.1646 9.2396 7.1379 22.8027 8.6256 98.1342 14.4197 1.2894 29.7787 261.2293 50.2496 70.3795 67.6032 0.0592 0.3536 7.4555 1.0768 3.9850 13.5125 0.0064 63.5715 70.8114 40.6409 16.7574 57.4956 17.5187 119.1302 7.9351 53.4046 41.5350 156.0119 0.0124 5.7723 16.9561 1.5456 1.3087 36.8112 21.6013 24.0223 411.2687 0.5510 88.3119 89.7665 57.4267 140.1192 0.0863 0.9486 139.8827 57.8954 1.1380 1.8213 3.1496 47.8604 0.5302
temp: 298.150 k
press: 1.00000 atm
elementType: 8 8 8 7 7 6 6 6 6 6 6 6 1 1 1 1 1 1 1 1 1 1 1 1 1 1
symmnumber: 1
zpe: 560815.5 jmol-1
zpe.correction: 0.213603 hartree
zpe.thermalcorrener: 0.227795 hartree
zpe.thermalcorrenthalpy: 0.228739 hartree
zpe.thermalcorrgfe: 0.172531 hartree
zpe.sumelectzpe: -609.329806 hartree
zpe.sumelectthermal: -609.315615 hartree
zpe.sumelectthermalent: -609.314671 hartree
zpe.sumelectthermalfe: -609.370878 hartree
dipole: 6.0881 0.0038 0.0013
dipole: 6.0881
quadrupole: -74.6344 -66.7486 -72.5894
quadrupole: -0.0048 0.0069 -5.8916
quadrupole: -3.3103 4.5755 -1.2652 -0.0048 0.0069 -5.8916
hfenergy: -609.5434097 hartree
pointgroup: C01 [X(C7H14N2O3)]
dipole: 2.39523 0.0029696 0.002905 debye
dipolederiv: -0.8885035 0.2140421 0.167526 0.2781173 -0.5667527 -0.1066857 0.4241103 -0.1881906 -0.562571 -0.8859163 -0.2144411 -0.1679314 -0.2783611 -0.5677815 -0.107637 -0.4242208 -0.1895685 -0.5638554 -1.3889128 -0.0014184 -0.0018425 -0.0006116 -0.591609 0.0471341 0.0002654 0.0613646 -0.3760483 -1.020116 0.4377903 0.0337414 0.1476475 -1.0530529 0.1806873 0.0028989 0.2072611 -0.4343789 -1.0185321 -0.4380647 -0.0348379 -0.1480373 -1.055104 0.180639 -0.0051831 0.2052495 -0.4343721 1.0623546 -0.2464805 -0.1657945 -0.2277508 0.3609385 0.1798316 -0.4965211 0.3005393 0.6627938 1.0597963 0.247701 0.1656562 0.2290611 0.3615912 0.1804432 0.496249 0.3014471 0.6644588 1.9048286 0.0011849 0.0027052 0.0004834 1.6441209 -0.3156553 0.0017406 -0.4511004 0.3225652 0.0220815 0.1481303 -0.0427273 0.1335548 0.5285918 -0.1285017 -0.0465174 -0.1146147 0.3238122 0.0226426 -0.1492875 0.0421946 -0.134774 0.5280747 -0.1285239 0.0457036 -0.1148391 0.3238046 0.6153466 -0.1275865 -0.0873186 -0.0210213 0.294373 -0.0514454 0.0243548 -0.0839433 0.2474266 0.6149323 0.1284885 0.0883393 0.02186 0.2947281 -0.0511567 -0.0232415 -0.0837604 0.2475809 -0.1109767 0.0475222 -0.0958451 0.1023437 0.0008521 0.0221961 -0.0551571 -0.0167475 -0.12239 -0.1111794 -0.0477042 0.0958506 -0.1028324 0.000333 0.022298 0.0553269 -0.0166137 -0.1221284 -0.0459259 -0.0689055 0.022852 0.0390703 0.1335987 0.0005643 -0.0082557 0.0033851 0.1273924 0.0866478 0.0240912 -0.1072659 -0.0260792 -0.0216534 0.0523765 -0.0417585 0.12858 -0.1488496 0.1172211 0.0694505 0.0491162 0.0087263 -0.1103573 -0.0361776 0.0300486 -0.105053 -0.0024254 -0.0459889 0.0683722 -0.0233053 -0.0395994 0.1336204 0.0003266 0.0077267 0.0035594 0.1274073 0.0862382 -0.0244092 0.1077601 0.026221 -0.021955 0.0530607 0.0420669 0.1289518 -0.1483227 0.1177198 -0.0682887 -0.0488111 -0.0079657 -0.1101872 -0.0364211 -0.0294083 -0.1053611 -0.0028471 -0.0563122 0.061269 -0.0177842 0.0321881 0.0421015 0.0749004 -0.1456843 0.1297927 -0.1170863 -0.0839852 -0.0495686 0.0305464 -0.1584537 -0.1489657 0.058896 -0.0146054 0.0502886 0.0792321 0.0434537 0.0349744 0.0410009 0.0624749 0.0156589 -0.1124862 0.0739554 -0.115408 -0.0267322 0.0439597 -0.0346473 -0.0405475 -0.0621216 0.0154407 -0.112719 -0.0735029 -0.1156453 -0.0269889 -0.056477 -0.0618001 0.0177737 -0.0325948 0.0418958 0.0748545 0.1455195 0.1299795 -0.1166667 -0.0843967 0.0495855 -0.0310511 0.1584545 -0.1485009 0.0592013 0.0140893 0.050447 0.0791891 unknown
polarizability: 118.2301265|0.0145114|104.5492481|0.0409537|-2.1629435|77.4412845 unknown
InChI: InChI=1S/C7H14N2O3/c1-8-5(11-3)6(12-4)9(2)7(8)10/h5-6H,1-4H3
charge 0 multiplicity 1
26 atoms
O  1.092366 -1.560785 -1.000291
O  1.085987 1.563587 1.002291
O  -2.895107 -0.003571 -0.002727
N  -0.794554 -1.070137 0.360462
N  -0.796648 1.068218 -0.362685
C  0.595251 -0.771059 0.148604
C  0.593476 0.772753 -0.147828
C  -1.63674 -0.002471 -0.003133
C  -1.297629 -2.378197 0.766508
C  -1.302411 2.375577 -0.767664
C  2.553559 -1.659243 -1.03376
C  2.546872 1.665433 1.039291
H  1.223099 -0.999771 1.03872
H  1.22263 1.003385 -1.036515
H  -2.399046 -2.328713 0.751182
H  -0.967325 -2.63575 1.791456
H  -0.96025 -3.164109 0.067776
H  -2.403718 2.32287 -0.755457
H  -0.97007 2.635843 -1.791256
H  -0.969231 3.161275 -0.066663
H  2.952013 -2.112501 -0.10098
H  3.038404 -0.671685 -1.18785
H  2.790634 -2.312662 -1.887327
H  2.780391 2.319396 1.893421
H  2.946523 2.119617 0.107473
H  3.033623 0.6790 1.194551
