program: Gaussian 09
title: 000114493
version: EM64L-G09RevD.01
frameworkgroup: C1[X(C9H16O)]
method: RPBEPBE
basis: SDD
operation: Freq
keyword: #pfreq=noraman
keyword: PBEPBE/SDD
title: #p freq=noraman PBEPBE/SDD
converged: NO YES NO NO
title: Mulliken charges:
elementType: O C C C C C C C C C H H H H H H H H H H H H H H H H
charge: -0.435777 -0.192627 -0.129020 -0.065842 -0.505001 -0.520123 -0.478530 -0.456889 -0.144782 -0.722301 0.240359 0.229043 0.210722 0.221789 0.221374 0.224412 0.230374 0.207877 0.221010 0.225041 0.205996 0.227934 0.238829 0.226446 0.200349 0.319335
chargesum: 0.00000
title: Mulliken charges with hydrogens summed into heavy atoms:
elementType: O C C C C C C C C C
charge: -0.116442 0.047732 0.100023 0.144880 -0.061838 -0.065336 -0.049643 -0.025852 0.083152 -0.056676
polarizability: 1.01762214e+02 6.59497405e-02 9.15017962e+01 1.55177536e+00 -1.04785895e+00 8.59309900e+01
1716.lowfreq: -7.3458 -0.0007 -0.0007 0.0002 12.7676 22.7012 79.2485 95.2498 161.7003
frequency: 79.1906 95.1973 161.6666 225.2241 263.6951 280.6173 315.4450 364.1807 388.6301 442.7955 459.6728 467.8408 556.2097 744.3040 754.9901 789.6600 800.9443 828.6903 852.1225 879.0542 918.6793 934.4435 941.6087 957.5098 967.3857 980.6360 1008.3313 1020.5917 1039.0399 1050.0651 1093.7066 1102.8677 1117.1459 1127.7377 1162.1257 1177.3106 1186.4365 1226.6879 1230.5157 1249.1908 1257.1899 1269.5075 1291.9242 1293.9451 1301.4368 1310.8836 1319.8247 1353.9213 1372.3022 1380.9018 1465.9679 1467.9246 1470.0092 1471.4187 1476.5807 1494.5974 2933.5153 2970.6622 2992.7877 2998.9622 3004.5969 3007.6082 3034.4408 3044.8811 3051.4122 3060.9429 3063.0620 3066.9072 3070.0428 3073.6202 3089.4344 3535.7821
redmass: 3.0106 2.9210 3.2099 1.1009 2.0166 1.2185 2.4513 1.9574 2.4277 2.3207 2.2495 3.1160 3.5439 3.4015 3.0656 2.0825 1.6304 2.5021 2.7077 2.5463 2.1371 1.7900 2.0818 1.9942 1.7103 1.5689 1.7053 2.3496 1.6395 1.4987 1.5730 1.5753 1.0976 1.2593 1.5828 1.7566 1.5639 1.3877 1.5358 1.5693 1.3633 1.4982 1.5011 1.4299 1.5373 1.4918 1.4635 1.5468 1.1576 1.2284 1.0773 1.0554 1.0514 1.0921 1.0842 1.0992 1.0827 1.0374 1.0590 1.0593 1.0615 1.0625 1.0871 1.1010 1.0896 1.1016 1.0970 1.0971 1.1035 1.1032 1.0993 1.0658
irintensity: 0.7693 1.1784 0.3716 8.7412 2.4714 64.3723 61.2714 0.8152 5.7577 1.1978 2.0631 14.9357 0.8074 2.3746 1.1136 10.9822 0.3192 6.0071 12.4489 2.7556 0.2764 7.4687 10.3723 2.4380 2.9559 7.3733 31.8662 4.1885 33.9566 17.6485 12.8472 7.5096 1.9281 2.1101 6.8916 11.7640 9.6150 1.5688 3.9101 6.1956 1.0749 0.3878 3.1662 3.0661 2.1905 12.9771 0.6254 3.2185 20.4928 26.4138 3.3171 1.9819 9.0288 18.2963 13.1807 5.7520 33.6213 20.9217 33.0299 50.5861 35.3223 57.5105 9.1002 18.7623 85.9463 2.5174 5.7788 29.7530 92.5937 86.8160 32.4046 3.8519
temp: 298.150 k
press: 1.00000 atm
elementType: 8 6 6 6 6 6 6 6 6 6 1 1 1 1 1 1 1 1 1 1 1 1 1 1 1 1
symmnumber: 1
zpe: 611525.9 jmol-1
zpe.correction: 0.232918 hartree
zpe.thermalcorrener: 0.242632 hartree
zpe.thermalcorrenthalpy: 0.243576 hartree
zpe.thermalcorrgfe: 0.198512 hartree
zpe.sumelectzpe: -426.956573 hartree
zpe.sumelectthermal: -426.946858 hartree
zpe.sumelectthermalent: -426.945914 hartree
zpe.sumelectthermalfe: -426.990978 hartree
dipole: -0.7659 1.0078 1.6105
dipole: 2.0484
quadrupole: -64.4966 -63.5007 -62.1259
quadrupole: 1.9069 5.0397 -3.1544
quadrupole: -1.1222 -0.1263 1.2485 1.9069 5.0397 -3.1544
hfenergy: -427.1894905 hartree
pointgroup: C01 [X(C9H16O1)]
dipole: -0.3087006 -0.423016 -0.6125756 debye
dipolederiv: -0.8289382 -0.1151014 -0.09874 -0.0916302 -0.722897 -0.0074493 -0.114105 -0.0011008 -0.1102639 0.0501028 -0.0062591 -0.0310542 0.0430468 0.091833 0.045298 -0.0336433 0.0209915 0.0909151 0.1183062 -0.0496888 -0.0053726 -0.0393709 0.1023783 -0.014689 -0.0191025 -0.0040068 0.0668144 -0.0541987 -0.0351535 -0.0563103 0.0513673 -0.053963 -0.0012545 -0.1329214 -0.0359994 0.1130573 0.0198019 0.0743611 -0.0165769 0.0422115 0.0155027 -0.0452767 -0.0148133 -0.0407556 0.024926 -0.0253354 0.0336322 0.0249863 0.0107049 0.0523308 -0.0291673 0.0124322 -0.0462583 0.079315 0.0703741 0.046197 0.0472122 0.0246305 0.0661874 0.0140082 0.0715448 0.005814 -0.0095344 0.1232904 0.0265508 0.0073022 0.0282329 -0.0098262 0.0384407 0.0070919 0.0513808 0.0413093 0.614117 0.0897409 0.01178 0.0469946 0.5553642 -0.0247552 0.0547 -0.0202384 0.2188548 -0.0954835 0.1188941 0.0192349 0.0731335 -0.1669564 -0.0450778 -0.0252635 -0.0531051 0.0788905 0.0231682 0.0678529 0.0663919 0.0599548 -0.107894 -0.0998682 0.0708576 -0.0966582 -0.0238338 -0.1007379 0.1385409 0.0081554 0.1366123 -0.0815795 0.0040055 0.011809 0.0058323 0.057797 -0.0495497 -0.0128459 0.0987336 -0.0143297 0.024901 0.0455284 0.1120733 0.0369081 -0.1599974 -0.1498758 -0.1135721 -0.0519079 -0.1358329 -0.0180784 -0.0368706 -0.0010394 -0.0020579 0.0707974 0.0702587 -0.0180413 0.0584663 0.0077964 0.0191361 0.1154712 0.0049025 0.0840193 -0.1624684 0.0311237 -0.0062095 0.02352 -0.0010186 -0.1091091 0.0953486 0.0225809 0.1572617 -0.0312508 0.0423416 -0.0372308 -0.0604896 -0.0260356 0.0363809 -0.0388005 -0.06326 -0.1008454 -0.0965733 -0.0622652 0.0944558 -0.1200643 0.0613384 0.0371468 0.0122615 -0.130044 0.0489131 -0.0439885 -0.0424465 -0.133612 0.0196511 -0.0926812 -0.1324528 0.0104422 0.0026677 -0.023326 0.066908 -0.1865877 -0.043426 0.1072708 -0.0688516 0.030631 0.0255415 0.0491443 0.0106902 0.0483047 0.045294 -0.0362207 -0.1064021 -0.0061832 0.007696 -0.0969838 -0.0418565 -0.079416 -0.1208639 0.0173793 -0.0116816 0.0710128 0.0076069 0.0069771 -0.0061218 0.0733757 0.0195317 -0.1194791 -0.1199494 0.0648665 -0.0896628 0.0325467 0.0863827 0.0000621 -0.1158504 0.0182117 0.0264613 0.0433239 -0.1315558 0.0236591 -0.120323 -0.0882301 0.012334 0.0215306 0.0167582 0.0805873 0.0757741 0.0157527 0.030034 -0.0166418 0.0625844 0.0602984 0.090675 -0.0004628 -0.1523895 0.3707122 -0.0202461 0.01917 -0.0132789 0.2955543 -0.0327257 0.0865138 0.0279183 -0.0342952 unknown
polarizability: 101.7310375|-0.1881078|91.3991918|-1.697054|-1.2827503|86.0647714 unknown
InChI: InChI=1S/C9H16O/c1-6(10)9-5-7-2-3-8(9)4-7/h6-10H,2-5H2,1H3
charge 0 multiplicity 1
26 atoms
O  2.62275 1.16837 0.325251
C  -0.555614 -0.909872 -0.669215
C  -1.800353 0.885947 -0.003469
C  0.504499 0.242463 -0.579171
C  -1.797488 -0.125325 -1.187856
C  -0.357865 1.467296 -0.087162
C  -1.038755 -1.320843 0.756014
C  -1.87497 -0.071399 1.225466
C  1.747329 -0.032218 0.29234
C  2.549922 -1.268608 -0.150509
H  -0.229058 -1.76141 -1.289668
H  -2.594034 1.651356 -0.019355
H  0.869778 0.437093 -1.61268
H  -2.711304 -0.745359 -1.238643
H  -1.631034 0.354876 -2.169717
H  -0.307216 2.308065 -0.802357
H  0.000987 1.846997 0.886205
H  -0.208543 -1.561432 1.442897
H  -1.675447 -2.222331 0.689746
H  -2.920844 -0.351384 1.4490
H  -1.455731 0.401653 2.132158
H  1.450327 -0.135429 1.351262
H  3.473131 -1.353491 0.448495
H  1.962624 -2.195895 -0.020076
H  2.832068 -1.195648 -1.219413
H  2.903943 1.366228 -0.605643
