program: Gaussian 09
title: 000114474
version: EM64L-G09RevD.01
frameworkgroup: C1[X(C17H37NO4S)]
method: RPBEPBE
basis: SDD
operation: Freq
keyword: #p
keyword: freq=noraman
keyword: PBEPBE/SDD
title: #p freq=noraman PBEPBE/SDD
converged: YES YES NO NO
title: Mulliken charges:
elementType: S O O O O N C C C C C C C C C C C C C C C C C H H H H H H H H H H H H H H H H H H H H H H H H H H H H H H H H H H H H H
charge: 1.107803 -0.536329 -0.619400 -0.566043 -0.594393 -0.083811 -0.356652 -0.398177 -0.419881 -0.581975 -0.614451 0.058568 -0.394121 -0.404899 -0.389053 -0.743783 -0.374977 -0.384037 -0.381747 -0.372409 -0.353614 -0.356527 -0.695190 0.220403 0.365299 0.261705 0.253837 0.209423 0.230238 0.257062 0.255627 0.260228 0.244818 0.250602 0.334415 0.235305 0.226030 0.193706 0.215374 0.200280 0.192666 0.195096 0.256339 0.272442 0.195546 0.196159 0.188911 0.192733 0.193860 0.194409 0.380746 0.188478 0.189642 0.188753 0.189085 0.194784 0.194274 0.210335 0.216303 0.210183
chargesum: 0.00000
title: Mulliken charges with hydrogens summed into heavy atoms:
elementType: S O O O O N C C C C C C C C C C C C C C C C C
charge: 1.107803 -0.155583 -0.619400 -0.566043 -0.594393 -0.083811 0.229050 0.117366 0.019780 0.190942 0.215384 0.293873 0.025615 0.010756 -0.001291 -0.215002 0.016728 -0.002393 0.006521 0.005711 0.024224 0.032531 -0.058369
polarizability: 3.18216710e+02 -9.98508033e+00 2.05774618e+02 4.91960873e-01 -4.65324861e-01 1.90462334e+02
1716.lowfreq: -0.0022 -0.0016 -0.0011 3.8047 5.4117 11.9542 16.0548 18.4917 31.5055
frequency: 11.7900 17.2450 31.4929 36.0744 42.0914 53.4252 60.3950 66.6619 75.2857 89.5781 96.7464 107.0438 118.4610 124.0331 135.7585 138.9208 151.2930 153.6021 173.6241 195.5008 199.3935 228.2072 233.3660 236.8367 246.2843 258.8502 278.5165 292.9854 307.0021 332.8545 339.0788 347.5179 352.4042 370.5688 391.4305 405.9125 417.6804 442.7521 457.3616 463.1583 469.6893 516.2106 524.4726 576.9185 592.5789 665.0782 720.8591 723.6390 731.7667 739.7826 750.7689 766.0162 804.1247 810.1472 825.7395 837.6715 848.4824 872.3167 877.7416 889.0467 914.5792 926.4769 940.7015 944.9506 970.6125 987.0226 992.4864 1005.9690 1016.8829 1019.5452 1027.5014 1033.8957 1051.0593 1059.0438 1064.6498 1066.0067 1078.7127 1079.7038 1084.0966 1096.1329 1102.0795 1124.1869 1125.4252 1143.4013 1167.1408 1186.4382 1192.8103 1199.0100 1208.8530 1215.9995 1217.5321 1236.4695 1248.7356 1258.4751 1267.9385 1278.6903 1281.4687 1284.1670 1287.9147 1292.4604 1297.2639 1299.4614 1306.0069 1319.2170 1321.9068 1335.9364 1343.5595 1350.4112 1352.0506 1356.6209 1357.7926 1362.1235 1365.5195 1389.1914 1392.0108 1394.0147 1421.6234 1435.8312 1452.5947 1459.3952 1460.6515 1462.8482 1463.4029 1464.5773 1468.3397 1468.9169 1471.7088 1474.2833 1478.0712 1479.2167 1480.6116 1483.4012 1486.3363 1489.4095 1495.4482 1505.1760 1561.3261 2115.6971 2920.6320 2948.5947 2950.2126 2952.1148 2953.5247 2958.1476 2962.9927 2966.0584 2968.0289 2969.3796 2970.3713 2973.1607 2983.1402 2986.9006 2988.0871 2993.9284 3002.3536 3013.3563 3014.2342 3015.5549 3020.5209 3021.0932 3026.7869 3036.9359 3043.2173 3044.9314 3049.5574 3066.8198 3069.6244 3072.0062 3091.6633 3129.7793 3132.0806 3139.0426 3142.5318 3147.1614
redmass: 5.1741 4.8884 6.2992 5.1070 3.4242 1.6882 4.2293 4.6418 2.0688 2.7731 2.7377 2.8275 2.2676 3.4824 2.1269 3.2507 2.1776 2.1427 3.5501 4.9674 2.6305 3.1706 1.1151 2.4796 1.9651 2.7701 2.7472 2.8463 2.8001 6.2080 1.3564 2.9249 2.9629 2.9975 3.4876 3.0983 3.9539 4.1398 3.0248 2.3030 2.7496 4.2533 2.6272 3.1079 4.6360 14.3554 1.0610 1.0812 1.1357 3.9213 1.1538 1.1596 1.2922 6.0453 2.1389 3.7053 1.7554 1.7461 1.5683 1.8888 2.4694 4.2177 1.8868 2.1110 1.9443 3.1700 1.7791 1.3258 1.2376 2.2989 1.3455 3.1144 2.9787 2.7978 2.8206 2.1625 2.2291 2.0893 1.5669 2.0281 1.9294 2.2890 1.8447 1.4707 1.8674 1.7383 1.3591 1.4507 1.4141 1.5333 1.5145 1.4406 1.3259 1.3178 1.2715 1.1656 1.0988 1.2832 1.1580 1.1283 1.1291 1.1745 1.1376 1.1685 1.2913 1.2271 1.4759 1.3561 1.3816 1.6710 1.6211 1.4732 1.2231 1.2633 1.2174 1.1261 1.1565 1.1411 1.0919 1.0762 1.0731 1.0753 1.0726 1.0698 1.0811 1.0774 1.0550 1.0809 1.0441 1.0687 1.0803 1.0788 1.0900 1.0925 1.0776 1.0484 1.1598 1.0757 1.0823 1.0588 1.0586 1.0590 1.0593 1.0595 1.0593 1.0617 1.0596 1.0605 1.0623 1.0363 1.0960 1.0750 1.0809 1.0980 1.1016 1.0380 1.0503 1.1030 1.0353 1.0961 1.1044 1.1044 1.1042 1.1044 1.0544 1.1058 1.1006 1.0994 1.1077 1.1051 1.1051 1.1042 1.1039 1.1111
irintensity: 5.6347 3.5053 0.4185 4.1543 0.9716 0.2785 0.2761 2.1155 0.0882 1.3461 3.5381 2.4442 2.5014 2.4221 0.4856 0.2379 0.8142 0.3465 0.7157 6.2328 2.7944 12.7684 0.0014 1.8124 2.3568 4.9158 2.1716 1.5162 1.8388 20.4061 1.6837 10.4846 0.2563 2.7123 6.7383 6.4633 2.7239 47.1587 8.3182 1.0721 0.1862 75.0910 0.3756 9.3874 38.0539 64.9329 17.5188 0.5768 7.6354 0.6494 5.9618 4.8865 1.4319 147.9006 39.5793 7.0404 46.0440 52.6318 42.9420 4.9004 23.4105 64.7327 33.6977 12.5069 12.8103 1.8040 1.8250 39.8824 99.7282 2.3652 1.0171 1.7817 4.6888 50.8682 3.0324 18.4433 0.3694 0.0376 1.0366 3.7652 8.8235 11.1773 12.1012 14.8665 2.5491 0.6159 19.9547 1.0743 2.2534 6.0417 8.4979 0.9807 1.3874 2.3509 4.3907 0.0900 0.9982 0.8142 1.5248 0.9699 0.1980 2.1524 0.3697 8.5005 0.4267 20.9750 0.1786 15.1684 2.3104 0.2628 0.3512 7.5168 12.0036 23.3374 11.3187 4.2702 17.6935 29.8604 21.0993 0.4222 0.1996 4.2617 6.9739 0.1254 2.1310 5.6392 9.0229 1.5646 11.2336 6.4443 0.4691 5.6368 6.3632 33.4769 30.8605 45.6884 431.9610 1272.2123 19.6207 0.2599 0.1964 6.6265 0.6478 0.8093 25.8707 23.1154 46.5339 171.9758 113.5773 38.8298 0.4133 11.9673 11.0663 0.7496 0.1203 16.9576 6.8624 0.8240 21.0864 13.8113 4.0782 8.3203 101.5487 224.0103 6.7566 31.9341 93.4143 54.0608 9.3196 6.2637 14.0437 1.3855 18.3701 3.6837
temp: 298.150 k
press: 1.00000 atm
elementType: 16 8 8 8 8 7 6 6 6 6 6 6 6 6 6 6 6 6 6 6 6 6 6 1 1 1 1 1 1 1 1 1 1 1 1 1 1 1 1 1 1 1 1 1 1 1 1 1 1 1 1 1 1 1 1 1 1 1 1 1
symmnumber: 1
zpe: 1381985.5 jmol-1
zpe.correction: 0.526370 hartree
zpe.thermalcorrener: 0.555631 hartree
zpe.thermalcorrenthalpy: 0.556575 hartree
zpe.thermalcorrgfe: 0.462977 hartree
zpe.sumelectzpe: -1421.558385 hartree
zpe.sumelectthermal: -1421.529124 hartree
zpe.sumelectthermalent: -1421.528180 hartree
zpe.sumelectthermalfe: -1421.621778 hartree
dipole: -18.3778 8.9449 -4.5773
dipole: 20.9453
quadrupole: -320.5453 -147.6227 -154.5117
quadrupole: 39.9150 -25.5356 -1.0010
quadrupole: -112.9854 59.9372 53.0482 39.9150 -25.5356 -1.0010
hfenergy: -1422.084755 hartree
pointgroup: C01 [X(C17H37N1O4S1)]
dipole: -7.0853078 3.6694958 -2.0589903 debye
polarizability: 317.5396534|-12.4187002|206.2634555|4.8627091|-0.9672893|190.6505528 unknown
InChI: InChI=1S/C17H37NO4S/c1-4-5-6-7-8-9-10-11-12-13-14-18(2,3)15-17(19)16-23(20,21)22/h17,19H,4-16H2,1-3H3
charge 0 multiplicity 1
60 atoms
S  7.416232 -0.793336 0.912341
O  4.292565 -0.937709 0.44449
O  6.413167 -2.161962 1.02525
O  8.846685 -1.068073 0.193066
O  7.388984 0.135203 2.265571
N  2.545965 1.319132 0.009546
C  1.822039 0.086925 -0.616921
C  4.027307 1.298945 -0.486057
C  0.403405 -0.185384 -0.098603
C  1.902895 2.609668 -0.470662
C  2.496752 1.25626 1.532457
C  4.938799 0.362546 0.324311
C  -0.216706 -1.359951 -0.902215
C  -1.61202 -1.788799 -0.387825
C  -2.717392 -0.721013 -0.561243
C  6.315951 0.256039 -0.3466
C  -4.115096 -1.224264 -0.134577
C  -5.226561 -0.166324 -0.317634
C  -6.623938 -0.664214 0.115378
C  -7.736442 0.390489 -0.081015
C  -9.134019 -0.104483 0.35468
C  -10.247229 0.94887 0.151764
C  -11.639535 0.446549 0.591365
H  1.80867 0.284777 -1.705715
H  2.511123 -0.752433 -0.404457
H  3.980499 0.989248 -1.544665
H  4.401359 2.336627 -0.421308
H  -0.252133 0.702021 -0.192046
H  0.429615 -0.473556 0.969038
H  2.386052 3.46272 0.031196
H  0.829574 2.598551 -0.230473
H  2.039639 2.69333 -1.560189
H  1.455805 1.392942 1.859997
H  3.12641 2.061255 1.942549
H  2.884911 0.272673 1.838657
H  5.12172 0.799248 1.334333
H  0.472141 -2.226334 -0.851799
H  -0.292889 -1.076421 -1.972554
H  -1.917298 -2.705427 -0.931082
H  -1.538098 -2.074698 0.681776
H  -2.752562 -0.402906 -1.624822
H  -2.471994 0.185606 0.030039
H  6.856184 1.210977 -0.447351
H  6.313951 -0.338771 -1.273467
H  -4.371917 -2.130831 -0.721037
H  -4.081793 -1.542158 0.928473
H  -4.967212 0.743974 0.263367
H  -5.263331 0.144983 -1.382822
H  -6.590925 -0.967338 1.182824
H  -6.881478 -1.578738 -0.458713
H  5.08674 -1.61891 0.736781
H  -7.478325 1.306895 0.490534
H  -7.771484 0.690681 -1.149472
H  -9.1027 -0.400479 1.424312
H  -9.392811 -1.022551 -0.21344
H  -10.279584 1.24264 -0.917457
H  -9.987618 1.866754 0.718165
H  -11.934279 -0.453678 0.019601
H  -12.417364 1.216277 0.43396
H  -11.643204 0.177034 1.6645
