program: Gaussian 09
title: 000114469
version: EM64L-G09RevD.01
frameworkgroup: C1[X(C8H18OS)]
method: RPBEPBE
basis: SDD
operation: Freq
keyword: #p
keyword: freq=noraman
keyword: PBEPBE/SDD
title: #p freq=noraman PBEPBE/SDD
converged: YES YES NO NO
title: Mulliken charges:
elementType: S O C C C C C C C C H H H H H H H H H H H H H H H H H H
charge: 0.579974 -0.633417 -0.295171 -0.299352 -0.375342 -0.381789 -0.685156 -0.688273 -0.682257 -0.687152 0.237989 0.260898 0.211155 0.233303 0.273510 0.206010 0.216446 0.292502 0.209336 0.228476 0.242158 0.216484 0.226933 0.205313 0.223708 0.209600 0.232260 0.221858
chargesum: 0.00000
title: Mulliken charges with hydrogens summed into heavy atoms:
elementType: S O C C C C C C C C
charge: 0.579974 -0.633417 -0.057182 -0.038455 0.069115 0.097730 0.033127 -0.001155 -0.026303 -0.023435
polarizability: 1.39835182e+02 -2.68092494e+00 1.06171016e+02 1.02334065e+00 4.63121236e+00 9.82836223e+01
1716.lowfreq: -25.2514 -0.0021 -0.0006 0.0010 3.0033 10.2401 20.1964 43.8854 80.8088
frequency: 15.2902 43.6089 80.8025 97.4262 127.1961 142.1470 170.5878 176.6134 202.8396 227.3582 231.2912 247.9150 265.1196 275.7453 334.1158 367.2443 385.1108 457.6617 463.3035 492.3358 564.7845 769.2949 781.0032 794.7712 812.8660 840.2360 953.9929 970.7586 993.8697 999.1040 999.7138 1029.7104 1044.0624 1056.9355 1108.3754 1133.9787 1151.6379 1159.7632 1185.7421 1202.9942 1260.1593 1277.4111 1284.6477 1306.5377 1348.8527 1361.9022 1389.4685 1392.0745 1393.9116 1395.7758 1449.8672 1455.7662 1466.0189 1468.7067 1470.3170 1477.1406 1480.7742 1483.1082 1484.2649 1488.3716 2944.6820 2965.0449 2969.8901 2975.6075 2978.5289 2982.8326 3016.5231 3017.9136 3032.4573 3032.9615 3050.8997 3061.1145 3072.9724 3077.2677 3080.7625 3082.5336 3083.6688 3087.4547
redmass: 3.3359 3.5672 2.3897 1.7873 2.5014 1.1983 2.2244 1.3645 1.3457 1.7319 1.7863 4.5620 1.8986 2.4784 2.4912 3.3322 3.2052 3.9710 3.9138 3.2106 2.6941 1.2410 1.2203 11.4038 2.5756 1.9625 1.5898 1.1880 1.4611 1.2867 1.4168 2.7182 1.4256 1.4070 2.5127 1.8450 2.1839 1.9739 1.3973 1.3783 1.2656 1.1867 1.1991 1.7225 1.5710 1.3233 1.2342 1.2024 1.2084 1.1882 1.0688 1.0618 1.0532 1.0481 1.0481 1.0445 1.0443 1.0508 1.0500 1.0497 1.0434 1.0602 1.0608 1.0367 1.0371 1.0360 1.0996 1.0946 1.0874 1.0883 1.0909 1.0983 1.0992 1.1003 1.0991 1.0997 1.0993 1.0984
irintensity: 1.1623 1.2338 0.2165 0.3334 0.5382 2.7364 1.7246 2.5223 1.0474 3.7997 3.1725 11.6220 0.2686 1.5823 0.1341 1.9635 1.1303 0.4442 3.9961 0.8067 8.4124 12.4052 13.4142 30.7053 3.6691 1.9065 3.5369 11.3787 10.9814 21.6387 1.4939 0.1996 0.4913 0.8819 0.0739 23.0471 0.5733 9.3996 16.8542 4.5774 1.6276 22.1810 0.8365 1.4285 1.0434 1.8918 11.2566 3.1962 11.5738 72.4533 17.7072 1.5413 16.9970 15.9725 21.3459 13.5635 16.6548 13.5867 3.9166 4.1342 24.9932 26.3431 39.5041 21.0737 27.5693 29.0131 1.4315 3.8631 14.9226 11.5152 10.4661 27.9936 44.4298 39.8394 51.0398 3.0648 70.2799 23.3075
temp: 298.150 k
press: 1.00000 atm
elementType: 16 8 6 6 6 6 6 6 6 6 1 1 1 1 1 1 1 1 1 1 1 1 1 1 1 1 1 1
symmnumber: 1
zpe: 640035.0 jmol-1
zpe.correction: 0.243776 hartree
zpe.thermalcorrener: 0.258344 hartree
zpe.thermalcorrenthalpy: 0.259288 hartree
zpe.thermalcorrgfe: 0.201670 hartree
zpe.sumelectzpe: -788.014316 hartree
zpe.sumelectthermal: -787.999748 hartree
zpe.sumelectthermalent: -787.998804 hartree
zpe.sumelectthermalfe: -788.056422 hartree
dipole: 0.6673 3.0757 2.9769
dipole: 4.3321
quadrupole: -64.9887 -76.7600 -73.4421
quadrupole: -1.4387 -1.2778 -3.7392
quadrupole: 6.7416 -5.0297 -1.7118 -1.4387 -1.2778 -3.7392
hfenergy: -788.2580925 hartree
pointgroup: C01 [X(C8H18O1S1)]
dipole: -0.2428711 0.832092 1.467484 debye
polarizability: 139.6065981|-3.3223937|96.6978137|2.6577131|1.95924|107.9854078 unknown
InChI: InChI=1S/C8H18OS/c1-5-7(3)10(9)8(4)6-2/h7-8H,5-6H2,1-4H3
charge 0 multiplicity 1
28 atoms
S  -0.044026 -0.612684 -0.168788
O  0.235334 -0.69369 -1.823638
C  -1.573651 0.690415 -0.016513
C  1.388451 0.605871 0.518009
C  -2.865019 -0.14455 0.028754
C  2.639051 0.31568 -0.322916
C  -1.46053 1.622615 -1.219997
C  1.482126 0.391984 2.032847
C  -3.017056 -1.008081 1.298726
C  3.356852 -1.012905 -0.004037
H  -1.377745 1.175828 0.957421
H  1.001375 1.612666 0.277316
H  -3.718929 0.560746 -0.038984
H  -2.916895 -0.777918 -0.87925
H  2.319219 0.309006 -1.38528
H  3.341028 1.165462 -0.198006
H  -2.438457 2.086936 -1.442772
H  -1.133999 1.03205 -2.102619
H  -0.722407 2.428796 -1.063879
H  2.269451 1.044498 2.456968
H  1.739415 -0.651592 2.284103
H  0.533343 0.642745 2.543131
H  -2.203484 -1.751125 1.382242
H  -2.999669 -0.380387 2.210134
H  -3.974431 -1.558934 1.287892
H  3.741113 -1.045029 1.031791
H  2.679564 -1.873959 -0.151943
H  4.215576 -1.150645 -0.684911
