program: Gaussian 09
title: 000114446
version: EM64L-G09RevD.01
frameworkgroup: C1[X(C8H12O5)]
method: RPBEPBE
basis: SDD
operation: Freq
keyword: #pfreq=noraman
keyword: PBEPBE/SDD
title: #p freq=noraman PBEPBE/SDD
converged: YES YES NO NO
title: Mulliken charges:
elementType: O O O O O C C C C C C C C H H H H H H H H H H H H
charge: -0.251697 -0.253057 -0.266016 -0.434939 -0.236526 -0.126238 -0.159424 -0.081844 -0.142507 -0.348095 -0.313933 0.290524 -0.751777 0.276149 0.256739 0.299397 0.250592 0.244075 0.208943 0.251841 0.200056 0.341582 0.247634 0.250385 0.248135
chargesum: 0.00000
title: Mulliken charges with hydrogens summed into heavy atoms:
elementType: O O O O O C C C C C C C C
charge: -0.251697 -0.253057 -0.266016 -0.093358 -0.236526 0.149911 0.097315 0.217554 0.108085 0.104923 0.137964 0.290524 -0.005623
polarizability: 1.16643238e+02 -1.98398074e+00 8.65667309e+01 3.45455208e+00 -3.43027089e-01 8.89302023e+01
1716.lowfreq: -28.1529 -23.3011 -10.3741 -3.2342 -0.0007 -0.0006 -0.0003 29.1362 51.1038
frequency: -28.1120 28.1512 51.0917 81.7485 94.6685 113.7859 200.6831 208.8257 222.1994 294.0598 309.5496 344.2470 359.1255 432.5028 464.0439 561.7478 599.6412 616.8072 727.7054 742.2491 806.4795 815.9604 830.1206 850.3394 855.5892 870.0327 892.2403 939.4469 956.6586 992.1847 1015.5419 1024.9116 1037.3989 1041.5081 1048.0586 1060.3642 1074.0252 1150.8122 1165.8742 1180.3599 1196.4885 1210.9376 1230.0447 1262.7350 1275.1332 1278.8620 1297.1667 1322.1416 1336.1840 1341.9916 1377.9824 1384.0140 1452.3803 1454.1422 1460.1321 1469.3371 1657.6844 2994.1893 2994.9660 3008.9948 3022.4922 3041.2141 3073.8895 3088.6555 3094.8110 3096.8923 3097.7166 3144.4820 3562.9072
redmass: 1.0742 9.0038 4.5804 3.8041 3.9875 3.6947 4.6380 5.0412 3.9028 1.3042 2.8190 3.5031 3.8703 3.7348 3.4040 3.2027 6.1123 6.0117 4.5556 5.8525 4.2862 5.5108 3.9396 2.9276 3.8420 2.9535 4.6421 2.7000 3.2167 1.8333 3.4611 3.6975 2.4243 1.6674 2.3243 2.1108 1.5865 1.2947 1.2774 1.1464 2.9499 1.8223 1.7667 1.1395 1.2156 1.3042 1.4175 1.3903 1.3173 1.4310 1.6132 1.2479 1.0611 1.0469 1.0885 1.0832 9.5687 1.0660 1.0660 1.0368 1.0849 1.0881 1.0884 1.0879 1.1009 1.0973 1.1004 1.1010 1.0662
irintensity: 1.2689 0.5166 3.5089 0.1987 1.5155 0.7968 3.9450 6.7856 29.7623 136.9189 38.5068 10.4365 0.4632 7.6684 2.5872 1.9539 15.1814 8.3779 0.8007 21.1868 21.9406 21.8361 7.2813 11.1946 23.8967 2.3927 24.5786 84.5086 30.1667 56.2643 99.6052 100.9925 13.0407 8.3660 9.0679 25.1562 7.7128 20.5136 29.3625 30.6669 301.9967 18.3604 27.7609 0.2426 1.6613 4.9403 3.3787 6.8258 3.5288 1.9988 4.1313 55.3444 27.4586 18.8622 3.4545 11.0769 183.8266 79.9144 8.0711 2.0292 58.9910 20.5937 26.7941 2.8542 26.2315 7.4841 9.8049 9.7741 7.1399
temp: 298.150 k
press: 1.00000 atm
elementType: 8 8 8 8 8 6 6 6 6 6 6 6 6 1 1 1 1 1 1 1 1 1 1 1 1
symmnumber: 1
zpe: 516124.7 jmol-1
zpe.correction: 0.196582 hartree
zpe.thermalcorrener: 0.208802 hartree
zpe.thermalcorrenthalpy: 0.209746 hartree
zpe.thermalcorrgfe: 0.156680 hartree
zpe.sumelectzpe: -687.116937 hartree
zpe.sumelectthermal: -687.104717 hartree
zpe.sumelectthermalent: -687.103773 hartree
zpe.sumelectthermalfe: -687.156838 hartree
dipole: 0.0716 2.1981 2.6775
dipole: 3.4649
quadrupole: -69.2891 -84.2935 -72.3339
quadrupole: 0.8816 3.4244 -9.5235
quadrupole: 6.0164 -8.9880 2.9716 0.8816 3.4244 -9.5235
hfenergy: -687.3135184 hartree
pointgroup: C01 [X(C8H12O5)]
dipole: -0.0322099 0.8335141 -1.078201 debye
dipolederiv: -0.5809955 0.1134871 0.1931604 0.1883528 -0.588712 -0.1833023 0.1592845 -0.1440693 -0.4989829 -0.931668 -0.0651512 -0.0991254 0.0372703 -0.3399099 -0.0007944 -0.1409634 0.0155934 -0.4143646 -1.5323995 -0.447371 -0.1035516 -0.5504524 -0.6309578 0.0622614 -0.1297766 0.0398945 -0.4117564 -0.7100256 0.1031607 0.1399924 0.1593149 -0.6017088 -0.3134688 0.12051 -0.2755691 -0.3047703 -0.6481889 -0.0744116 -0.1034168 -0.3332213 -0.5990162 0.2206211 0.2012278 0.3560084 -0.6677063 0.4664489 -0.074479 0.1566443 -0.0897696 0.1384936 0.0148236 0.2439274 -0.0097286 0.2682959 0.1601942 -0.0435765 0.0643595 -0.1874648 0.4293925 0.1662092 -0.0722771 0.1569788 0.186166 0.7012574 0.1280586 0.0778121 -0.0006594 0.1487521 0.0594868 0.3960331 0.1098501 0.2120518 0.3595193 -0.0382402 -0.1760166 -0.1708535 0.4663019 0.246075 -0.112668 0.2129007 0.2791194 0.3377951 -0.1095413 -0.1441105 -0.059769 0.1661109 0.0139078 -0.1983829 0.1747283 0.4977822 0.6396655 0.0719692 0.0462028 0.2161811 0.3004904 0.0890993 -0.0825086 -0.0292012 0.1010029 1.6169253 0.481351 0.2463004 0.8819935 0.839483 -0.3617957 -0.093452 -0.5104984 0.8311185 -0.2385811 0.0000638 -0.1778218 0.0384329 -0.0025685 0.0776494 -0.2485565 0.0466707 -0.205304 -0.0106753 -0.037781 -0.0567851 -0.0751897 -0.0530113 -0.0501323 -0.0742897 -0.0388619 0.0215138 0.0502072 0.0131539 -0.0552802 0.0314769 -0.0027739 -0.0556318 -0.0215214 -0.0689661 -0.1360924 -0.0079891 -0.0203862 0.0490649 0.0154748 0.1055287 0.0380164 -0.0277682 -0.0138774 -0.0163189 -0.048765 -0.0712618 0.0658422 -0.0744465 -0.1017284 -0.0023724 0.0766224 0.0238918 0.0265494 -0.0033842 0.1304605 0.0268873 0.1144806 -0.013603 -0.0178999 0.0152524 0.0303823 0.0602977 -0.0553563 -0.0583602 -0.0854752 -0.0408604 0.069266 -0.0107682 -0.0230122 -0.0801635 -0.1479464 -0.0814334 0.0543603 -0.0363904 0.0933027 0.016372 0.0516236 -0.0286118 0.0220572 0.0962222 -0.0147441 -0.037149 0.0069324 -0.13463 -0.1111621 -0.1241357 0.0055776 -0.0790225 0.0054585 0.4091649 0.0043649 -0.0825431 -0.004876 0.2549761 0.1122136 -0.033484 0.0706665 0.0341653 0.0592227 0.0273669 0.0850713 -0.0045519 0.1247683 -0.0453885 0.0508496 -0.029959 -0.0320366 0.0850081 0.0317409 -0.0303715 0.0651076 -0.054501 -0.0088955 -0.0007857 -0.0238241 0.1237338 -0.0212028 -0.0818289 -0.0073817 -0.1146439 0.0397176 0.022598 0.0187734 0.0441186 0.0918013 unknown
polarizability: 116.816416|1.5630275|86.5252424|2.9183228|0.3259352|88.7985125 unknown
InChI: InChI=1S/C8H12O5/c1-4(9)13-6-3-12-7-5(10)2-11-8(6)7/h5-8,10H,2-3H2,1H3
charge 0 multiplicity 1
25 atoms
O  0.941338 1.711836 -0.603269
O  1.308269 -0.793077 1.310133
O  -1.840658 0.521367 -0.250656
O  3.015664 -1.3685 -1.212837
O  -2.909984 -1.121475 1.021596
C  0.368131 -0.509654 0.202628
C  1.170989 0.267781 -0.86676
C  -0.68872 0.504681 0.698075
C  2.650665 -0.091437 -0.581437
C  0.034035 1.845229 0.5660
C  2.664563 -0.313507 0.935329
C  -2.902605 -0.358293 0.032446
C  -3.986394 -0.215672 -1.012791
H  -0.072455 -1.459251 -0.140507
H  0.866006 0.05866 -1.906997
H  -1.042481 0.256384 1.711489
H  3.320886 0.72938 -0.900938
H  -0.652173 2.682743 0.364695
H  0.625519 2.046617 1.480553
H  3.389677 -1.091816 1.221696
H  2.883256 0.631282 1.469427
H  3.004208 -1.261938 -2.197732
H  -3.576206 -0.414936 -2.017752
H  -4.374914 0.817482 -1.017573
H  -4.803619 -0.918384 -0.796618
