program: Gaussian 09
title: 000114438
version: EM64L-G09RevD.01
frameworkgroup: C1[X(C9H14O)]
method: RPBEPBE
basis: SDD
operation: Freq
keyword: #pfreq=noraman
keyword: PBEPBE/SDD
title: #p freq=noraman PBEPBE/SDD
converged: YES YES NO NO
title: Mulliken charges:
elementType: O C C C C C C C C C H H H H H H H H H H H H H H
charge: -0.287534 0.447814 0.072093 -0.425195 -0.565237 -0.449724 -0.251095 -0.693198 -0.695354 -0.234719 0.170575 0.207515 0.184478 0.263450 0.228153 0.247793 0.233877 0.210995 0.222200 0.226494 0.197767 0.229292 0.223584 0.235977
chargesum: 0.00000
title: Mulliken charges with hydrogens summed into heavy atoms:
elementType: O C C C C C C C C C
charge: -0.287534 0.447814 0.242668 -0.033202 -0.073634 -0.201931 -0.017218 -0.033508 -0.044711 0.001257
polarizability: 1.31812006e+02 1.45681229e+00 9.93150124e+01 7.48084995e+00 4.68331256e+00 6.79596575e+01
1716.lowfreq: -15.5366 -0.0006 -0.0006 -0.0005 2.8938 5.9717 33.3482 49.6159 81.0644
frequency: 33.1978 49.0279 81.0386 114.6052 181.0185 215.5701 239.7625 261.8477 298.7285 360.8624 406.5848 418.8439 484.2162 525.9468 668.8954 695.3569 793.7468 809.2661 858.8847 872.2862 893.0016 895.3618 916.9171 934.8270 937.2724 956.2863 982.0101 989.1204 1018.7064 1079.7190 1096.3339 1116.2127 1145.6237 1171.5372 1177.4541 1194.4616 1236.9653 1304.4614 1309.6068 1329.8381 1358.7542 1366.4011 1377.7734 1390.2191 1393.5122 1454.4655 1463.4889 1470.1095 1472.6256 1486.4333 1532.7513 1612.8673 2887.3129 2909.0683 2973.0747 2981.5255 2982.2418 2989.9417 3027.9201 3074.9982 3084.4143 3091.3649 3096.9938 3154.9192 3168.5600 3197.4714
redmass: 2.8205 3.1341 3.7873 3.0931 1.0689 1.9337 1.4970 2.4561 2.5053 1.7365 2.3508 3.0945 2.5326 2.4320 2.9958 1.3460 3.0861 5.4881 1.9370 3.0704 2.7702 1.5054 1.2215 1.3956 1.3260 1.7762 4.2803 1.8222 1.6844 1.1771 1.2027 1.8990 2.0447 1.5434 1.7275 1.5359 1.4262 1.3272 2.4348 1.4460 2.1450 1.3867 1.3121 1.2346 1.1120 1.0493 1.0633 1.0634 1.0626 1.0504 6.0197 6.3359 1.0647 1.0837 1.0872 1.0543 1.0493 1.0356 1.0952 1.0989 1.1005 1.0995 1.1000 1.0907 1.0930 1.1078
irintensity: 0.3180 0.4097 0.9176 8.5153 0.2415 0.4805 0.9747 0.4816 1.2792 16.2768 4.6160 5.6251 2.4451 0.1420 9.5477 62.1371 5.5139 7.5944 11.7296 4.3612 6.5878 28.1800 2.6043 1.4214 0.1029 16.8362 112.0189 21.1567 4.8891 0.1400 0.1708 84.4012 19.2044 17.2260 16.7296 26.7701 1.9501 60.8606 4.9196 6.7176 1.3480 17.9867 27.2606 25.2543 27.8257 5.6606 4.1864 1.7218 4.2514 17.8081 1.2249 0.5374 57.4649 70.9099 24.0198 9.5530 43.0054 21.4984 7.2166 34.4173 12.1397 62.8648 36.8975 12.4009 15.2225 19.4316
temp: 298.150 k
press: 1.00000 atm
elementType: 8 6 6 6 6 6 6 6 6 6 1 1 1 1 1 1 1 1 1 1 1 1 1 1
symmnumber: 1
zpe: 538646.2 jmol-1
zpe.correction: 0.205160 hartree
zpe.thermalcorrener: 0.216288 hartree
zpe.thermalcorrenthalpy: 0.217232 hartree
zpe.thermalcorrgfe: 0.167401 hartree
zpe.sumelectzpe: -425.749408 hartree
zpe.sumelectthermal: -425.738280 hartree
zpe.sumelectthermalent: -425.737336 hartree
zpe.sumelectthermalfe: -425.787166 hartree
dipole: 1.0892 -0.3799 1.2663
dipole: 1.7130
quadrupole: -56.6293 -57.7228 -63.1090
quadrupole: -1.0786 2.0059 1.2927
quadrupole: 2.5244 1.4309 -3.9553 -1.0786 2.0059 1.2927
hfenergy: -425.9545679 hartree
pointgroup: C01 [X(C9H14O1)]
dipole: 0.4280989 -0.1190186 0.5067086 debye
dipolederiv: -1.3133516 -0.070919 0.0668996 -0.167421 -0.462964 -0.0085042 0.1530852 0.0189131 -0.399479 -0.1340392 0.0730392 0.0437284 0.0736773 0.129504 0.0764892 0.0868273 0.0550293 -0.1213056 0.9842552 0.0184103 -0.0053582 -0.0678584 0.4208094 0.0564335 0.1574981 0.0621935 0.3779301 0.8617152 0.0569344 -0.0429543 0.2338147 0.3713939 -0.0076727 -0.3371333 -0.0125535 0.4239504 -0.1523412 -0.0855244 -0.0824394 -0.0650365 -0.2365793 -0.0338268 -0.1414817 -0.0192777 0.1395685 -0.1230574 -0.118009 0.0054764 -0.1528559 0.1051274 -0.005714 0.0485248 0.0145361 -0.1774923 -0.0722171 0.0933711 0.0794902 0.1579037 0.0074439 0.0587005 0.0871857 0.0325646 -0.2458153 -0.1266443 0.0628719 0.0220612 0.1274353 -0.1774692 -0.0221272 -0.0200384 -0.0308517 0.0444516 -0.0806873 -0.04332 0.0451103 -0.0676994 -0.0921086 0.061025 0.0282438 0.0579803 0.0392593 0.1896404 -0.0123422 0.0952826 0.0135397 -0.127434 0.0042689 0.0852961 0.0050625 -0.1589787 -0.0651976 0.0008894 0.047422 0.0200822 -0.0056493 -0.0300844 -0.0623943 -0.0556789 -0.2484524 -0.0138858 0.0168919 0.0156134 -0.0014289 -0.2062407 0.0066513 0.0518292 -0.0369148 0.0362899 -0.1263822 0.0050464 -0.1020495 -0.0838258 0.0376415 -0.0598723 -0.0091761 0.0174938 -0.2018994 0.0961474 -0.0566321 0.0533235 -0.0659236 0.0689102 0.0635232 0.0564825 0.0738378 0.064089 0.1134551 -0.0062574 -0.0413482 -0.0093317 0.0882214 -0.0733861 -0.0457171 -0.1045775 -0.0571242 0.0954181 0.0448915 -0.0193733 0.030806 -0.108351 -0.0313324 -0.0198684 -0.0300599 0.173857 -0.0112114 0.0972429 -0.0344471 0.1051562 -0.0104718 0.005653 -0.0324289 0.0081788 0.1726571 -0.1962299 0.0209723 -0.0628322 0.0042128 0.0949084 -0.0178531 -0.0670254 -0.0076477 0.0768589 0.0699831 -0.1114699 0.0702851 -0.08598 -0.0822063 0.079184 0.0701638 0.0880133 0.022745 0.1084932 0.0021992 -0.026191 0.0121737 0.0641743 -0.0150677 0.016624 -0.0678346 -0.1323644 -0.1893572 -0.0414934 -0.055879 -0.0182188 0.0913238 0.0180205 -0.070946 0.0036767 0.0662013 0.0763626 0.1148852 0.0253683 0.0801055 -0.1183787 -0.0262445 0.0300851 -0.0358555 0.0795917 0.1109278 -0.0050851 -0.0206793 -0.0102615 0.0740678 -0.0678035 0.0238104 -0.0096557 -0.1374209 -0.1017959 -0.0565931 -0.0765093 -0.0630656 0.0743267 -0.0304603 -0.0894466 -0.0265722 0.1628823 unknown
polarizability: 131.9544956|1.3109231|99.7835292|7.1024706|1.9390307|67.3486509 unknown
InChI: InChI=1S/C9H14O/c1-8(2)10-7-9-5-3-4-6-9/h3-5,8H,6-7H2,1-2H3
charge 0 multiplicity 1
24 atoms
O  1.246324 0.12389 -0.224658
C  -1.081288 -0.327841 0.232897
C  2.652545 0.07443 0.237717
C  0.326149 -0.725174 0.563407
C  -1.579492 1.106433 0.27189
C  -2.124879 -1.144824 -0.138051
C  -3.041487 0.991498 -0.113922
C  3.304366 -1.294148 -0.047354
C  3.357732 1.224352 -0.491872
C  -3.339373 -0.331293 -0.344953
H  2.665755 0.263818 1.337421
H  0.485475 -1.800177 0.336873
H  0.544885 -0.567643 1.647032
H  -1.002739 1.736811 -0.434804
H  -1.444459 1.567095 1.272499
H  -2.073427 -2.22995 -0.269252
H  -3.721407 1.842545 -0.199566
H  4.367611 -1.284095 0.256767
H  2.805936 -2.111586 0.50422
H  3.251549 -1.520578 -1.127507
H  4.415142 1.295259 -0.178809
H  2.857223 2.182996 -0.272344
H  3.323201 1.059257 -1.583517
H  -4.310741 -0.732872 -0.645713
