program: Gaussian 09
title: 000114416
version: EM64L-G09RevD.01
frameworkgroup: C1[X(C16H30O2)]
method: RPBEPBE
basis: SDD
operation: Freq
keyword: #pfreq=noraman
keyword: PBEPBE/SDD
title: #p freq=noraman PBEPBE/SDD
converged: NO YES NO NO
title: Mulliken charges:
elementType: O O C C C C C C C C C C C C C C C C H H H H H H H H H H H H H H H H H H H H H H H H H H H H H H
charge: -0.262022 -0.244753 0.033027 -0.399316 -0.454863 -0.500547 -0.752431 -0.351794 -0.289171 -0.362239 -0.336211 -0.518065 0.247723 -0.355910 0.370471 -0.693951 -0.790259 -0.798827 0.232508 0.199140 0.191570 0.203250 0.257851 0.211114 0.203493 0.202959 0.215691 0.224097 0.233968 0.225603 0.221477 0.203184 0.217144 0.184648 0.184750 0.243065 0.244263 0.197005 0.198134 0.209534 0.209018 0.217069 0.213213 0.227729 0.218063 0.218882 0.219148 0.231568
chargesum: 0.00000
title: Mulliken charges with hydrogens summed into heavy atoms:
elementType: O O C C C C C C C C C C C C C C C C
charge: -0.262022 -0.244753 0.265535 -0.008606 0.006237 -0.085940 -0.109684 0.107777 -0.067694 0.058089 0.033188 -0.030737 0.247723 0.039229 0.370471 -0.058330 -0.131254 -0.129230
polarizability: 2.05461708e+02 -1.75948349e+01 1.85328283e+02 -1.32478475e+00 5.97500478e+00 1.49786954e+02
1716.lowfreq: -32.5461 -15.7121 -9.0644 -3.3732 -0.0003 0.0004 0.0007 7.7053 14.7505
frequency: -31.2904 -4.7184 11.8789 18.2177 32.2488 44.2245 62.5980 70.2375 82.6833 93.6677 118.6714 132.6258 134.0007 141.8589 172.4029 181.8191 195.5516 217.6529 234.9879 237.8465 252.6102 302.5206 319.2453 330.5816 360.0904 372.1470 394.8166 402.3858 437.4133 470.8229 498.0770 507.0926 553.3428 574.2149 657.9419 719.7550 720.4613 750.2580 754.4804 785.2959 833.9910 837.6508 859.0279 868.0900 873.1771 901.1041 925.7767 945.7366 953.1091 955.0337 976.7040 993.1866 995.5014 1010.8172 1027.5418 1044.2080 1068.1722 1073.4811 1081.7435 1103.3049 1105.9053 1107.8615 1111.3066 1128.9855 1134.1646 1150.8501 1173.4846 1196.6799 1202.4516 1236.2596 1241.4966 1243.5860 1252.6568 1255.4868 1282.9142 1290.2386 1302.1174 1305.0570 1308.4349 1331.1496 1346.3181 1351.0032 1357.4896 1359.0473 1363.1233 1366.7836 1383.2607 1386.6964 1390.8178 1396.3279 1437.6482 1450.5962 1454.3547 1456.4104 1459.8365 1462.2449 1462.4240 1468.4277 1471.1477 1473.0586 1475.0034 1478.4139 1479.3443 1485.3355 1487.9499 1490.0118 1638.0621 1692.7396 2950.7110 2951.2686 2953.9789 2962.0883 2964.4857 2966.3097 2969.1453 2972.5865 2981.6256 2982.6231 2987.2315 2989.5792 2993.1738 3013.3027 3020.9204 3025.9656 3027.5402 3029.9159 3030.1429 3034.1825 3050.3134 3057.4495 3059.9501 3067.8109 3068.3868 3069.3876 3072.0249 3076.6340 3091.6045 3106.9542
redmass: 1.8186 3.8715 3.6292 2.8774 3.2048 4.8672 4.0724 3.5287 2.9188 1.7174 2.4391 1.6136 1.4823 2.2633 1.4934 3.5850 1.2920 2.0543 1.1806 1.9807 4.5892 2.6109 2.4546 2.3219 2.5495 2.1440 2.7022 2.4175 2.3233 3.0677 2.3660 2.7838 2.6483 2.7717 4.7488 1.7009 1.1916 1.1968 2.4020 3.2585 1.5786 1.3091 2.0914 2.1765 1.8128 1.8055 2.1340 1.4134 1.2381 1.7194 1.7141 1.7831 1.2794 3.3862 2.1721 2.0089 2.7260 2.2411 1.6677 2.0663 1.7743 1.8121 2.3022 2.4454 2.6794 2.0425 1.4944 1.5613 1.7543 1.2055 1.3973 1.5956 1.2427 1.3406 1.0586 1.1152 1.3033 1.4266 1.1822 1.2960 1.3928 1.5297 1.4396 1.5586 1.4592 1.4445 1.2183 1.3358 1.2177 1.2358 1.0872 1.0896 1.0549 1.0778 1.0853 1.0674 1.0672 1.0745 1.0501 1.0706 1.0679 1.0436 1.0708 1.0480 1.0833 1.0845 8.9593 6.4364 1.0598 1.0586 1.0369 1.0385 1.0602 1.0440 1.0584 1.0370 1.0634 1.0623 1.0796 1.0710 1.0856 1.0973 1.1002 1.0969 1.0602 1.0967 1.1004 1.1005 1.0948 1.1026 1.0981 1.0980 1.0990 1.1007 1.0992 1.0907 1.0960 1.1050
irintensity: 0.0961 0.2973 0.0859 0.0811 0.1589 0.8854 1.7187 0.9444 0.0885 0.8289 0.0425 0.9206 0.1720 1.0527 1.4860 3.8187 0.5692 1.5542 0.4999 3.1080 3.4396 0.7665 0.9742 6.9618 3.8704 0.9822 2.8790 2.6239 3.6040 2.6732 0.9635 2.7805 4.4570 4.5206 3.9454 3.3479 18.5718 0.3387 3.8689 4.1060 15.1936 5.0295 1.9474 5.8748 11.6112 7.9067 14.2907 3.0000 0.0796 3.2466 5.2181 3.7472 6.2546 15.1717 26.9545 2.3950 21.7814 15.9274 2.7500 6.2535 45.2337 6.1809 30.9659 58.3244 155.9900 1.8469 5.7999 0.1274 2.4129 5.7993 41.3738 12.9087 0.6339 2.5700 0.0944 0.8154 1.4250 30.7786 0.3588 1.7843 3.8405 4.4784 3.5833 7.0059 3.9048 11.2971 17.0560 28.2158 10.7284 7.7403 28.8474 12.7763 0.6261 10.0879 14.2094 3.0058 1.6499 1.1156 21.9124 5.1352 11.7548 11.4392 7.1076 13.8096 19.6287 10.3101 133.1640 4.4403 45.3664 14.9280 34.5908 50.5944 18.8880 36.3543 49.5417 33.8524 38.0838 3.2291 13.4669 24.9218 19.9394 40.1991 12.0276 9.4770 44.4417 41.4310 8.1039 42.2648 17.6697 55.2922 61.6173 36.4443 17.7004 111.7034 51.9933 66.7724 33.9364 22.9496
temp: 298.150 k
press: 1.00000 atm
elementType: 8 8 6 6 6 6 6 6 6 6 6 6 6 6 6 6 6 6 1 1 1 1 1 1 1 1 1 1 1 1 1 1 1 1 1 1 1 1 1 1 1 1 1 1 1 1 1 1
symmnumber: 1
zpe: 1119024.8 jmol-1
zpe.correction: 0.426214 hartree
zpe.thermalcorrener: 0.448025 hartree
zpe.thermalcorrenthalpy: 0.448969 hartree
zpe.thermalcorrgfe: 0.372380 hartree
zpe.sumelectzpe: -776.667029 hartree
zpe.sumelectthermal: -776.645218 hartree
zpe.sumelectthermalent: -776.644273 hartree
zpe.sumelectthermalfe: -776.720863 hartree
dipole: 0.5357 0.5691 1.6575
dipole: 1.8326
quadrupole: -106.1285 -109.2933 -120.3658
quadrupole: -1.8138 -2.7148 -0.8463
quadrupole: 5.8007 2.6359 -8.4366 -1.8138 -2.7148 -0.8463
hfenergy: -777.0932429 hartree
pointgroup: C01 [X(C16H30O2)]
dipole: -0.2652391 0.1870773 -0.6437904 debye
polarizability: 196.5218239|20.1631852|194.5768303|0.0091061|-5.1695101|149.4782915 unknown
InChI: InChI=1S/C16H30O2/c1-5-6-7-11-16(17)18-13-12-15(4)10-8-9-14(2)3/h9,15H,5-8,10-13H2,1-4H3
charge 0 multiplicity 1
48 atoms
O  0.110036 -2.4091 -0.602411
O  0.973314 -1.845829 1.491672
C  -2.696379 -1.311514 -0.569652
C  -3.68043 -0.265146 0.019319
C  -2.12013 -2.242835 0.529569
C  -3.094322 0.68049 1.11397
C  -3.390612 -2.114756 -1.695694
C  -0.994261 -3.176512 0.057994
C  -1.79057 1.352975 0.719224
C  3.001384 -0.149187 0.28784
C  4.01475 0.643436 -0.566514
C  2.032766 -0.978901 -0.576677
C  1.019414 -1.763796 0.241919
C  4.992589 1.48419 0.285809
C  -1.623292 2.597072 0.183228
C  6.003989 2.278717 -0.568347
C  -0.237061 3.121098 -0.161097
C  -2.759881 3.558658 -0.118378
H  -1.848884 -0.756278 -1.019279
H  -4.050482 0.360637 -0.818345
H  -4.56546 -0.790187 0.43884
H  -2.934075 -2.881301 0.935051
H  -1.732918 -1.646478 1.375013
H  -2.926207 0.101549 2.043312
H  -3.865501 1.434945 1.36084
H  -4.233944 -2.710847 -1.29418
H  -3.79798 -1.43582 -2.468077
H  -2.692733 -2.806531 -2.201126
H  -0.56905 -3.735828 0.910736
H  -1.320682 -3.87481 -0.728817
H  -0.882451 0.75312 0.88895
H  2.421462 0.548831 0.923354
H  3.537861 -0.819635 0.986026
H  4.596255 -0.057733 -1.20172
H  3.469394 1.314917 -1.2632
H  1.47376 -0.331506 -1.28053
H  2.589237 -1.695983 -1.212674
H  4.412008 2.18367 0.92132
H  5.538046 0.814001 0.98074
H  6.62466 1.599528 -1.182923
H  5.483079 2.971057 -1.25672
H  6.68455 2.878638 0.063359
H  -0.16304 3.378738 -1.236974
H  0.549647 2.380828 0.071081
H  -0.009996 4.048965 0.401505
H  -2.614031 4.518334 0.416624
H  -2.788674 3.801875 -1.199484
H  -3.746955 3.156839 0.162623
