program: Gaussian 09
title: 000114415
version: EM64L-G09RevD.01
frameworkgroup: C1[X(C13H21NO2)]
method: RPBEPBE
basis: SDD
operation: Freq
keyword: #p
keyword: freq=noraman
keyword: PBEPBE/SDD
title: #p freq=noraman PBEPBE/SDD
converged: YES YES NO NO
title: Mulliken charges:
elementType: O O N C C C C C C C C C C C C C H H H H H H H H H H H H H H H H H H H H H
charge: -0.428762 -0.428685 -0.229482 -0.107373 -0.107269 0.419951 -0.337577 -0.337412 -0.709523 -0.709981 -0.355416 -0.353633 -0.407926 -0.407773 0.447333 -0.811630 0.189773 0.189809 0.200710 0.218238 0.200828 0.218130 0.220299 0.249064 0.237926 0.220364 0.249108 0.237926 0.222323 0.222371 0.226855 0.226468 0.329090 0.329003 0.221891 0.222685 0.232294
chargesum: 0.00000
title: Mulliken charges with hydrogens summed into heavy atoms:
elementType: O O N C C C C C C C C C C C C C
charge: -0.099672 -0.099682 -0.229482 0.082400 0.082540 0.419951 0.081371 0.081546 -0.002234 -0.002583 -0.133093 -0.131262 -0.181070 -0.181305 0.447333 -0.134760
polarizability: 2.14221571e+02 -1.78658245e-01 1.53755409e+02 -4.86200940e-01 -5.98573711e+00 1.08449692e+02
1716.lowfreq: -27.2073 -11.7017 -7.6707 -7.1847 -0.0008 -0.0007 0.0003 45.9925 46.9138
frequency: -26.9674 45.9388 46.6385 66.6526 70.6418 90.8446 101.6196 106.0854 169.1529 194.6184 199.2601 201.6997 220.3652 231.6584 278.1891 280.6262 287.1007 295.8872 329.8920 332.2531 360.6704 410.3620 425.8834 434.5190 446.7993 509.1141 520.8979 625.1049 651.7971 673.2612 726.1621 794.1840 817.2740 829.7199 841.4085 871.3043 894.7862 897.9728 918.8957 935.4971 958.8252 968.6372 972.0480 983.2935 1003.2718 1007.0874 1045.3107 1057.9937 1063.8819 1105.6586 1109.8053 1127.2105 1142.7902 1152.4758 1190.6616 1204.0417 1206.1761 1228.9562 1272.3384 1289.0844 1301.7306 1304.1223 1321.7454 1336.2795 1347.6779 1358.5731 1366.3860 1367.1355 1387.0003 1387.4364 1397.0239 1416.1921 1417.8204 1461.1217 1461.6212 1467.6193 1468.4936 1472.2999 1473.0146 1483.1790 1483.3276 1515.2782 1567.8422 1627.2748 2912.2386 2930.3026 2961.3761 2962.3272 2969.3547 2994.1157 2994.5672 3049.0685 3079.1020 3086.4516 3087.0743 3092.3835 3092.6440 3097.4521 3098.4622 3114.0956 3117.0424 3159.5198 3164.2648 3553.2364 3553.4457
redmass: 1.0132 4.3462 3.7362 2.6644 5.1400 4.1877 2.1894 2.7963 2.6722 1.3090 1.2988 2.5778 2.4792 2.9096 1.2921 3.6272 1.1701 4.3098 3.5484 2.3938 3.1269 2.9488 2.1177 4.3295 3.0749 2.8394 3.5698 4.0979 4.3295 3.6268 3.1052 4.1876 1.5698 1.2922 3.0782 2.2294 1.3226 1.5435 1.9735 1.2914 1.3702 3.8695 4.2265 1.4601 2.8137 2.0178 1.5265 1.4553 1.3854 2.3856 1.8391 1.8929 1.6661 2.4288 1.2594 1.8189 1.5134 2.7097 2.0284 1.1641 1.3314 1.3077 1.4127 1.3366 1.3943 3.0817 1.2071 1.2415 1.2097 1.2082 1.2263 3.2818 1.5457 1.0783 1.0823 1.0501 1.0535 1.0516 1.0998 1.0570 1.0596 2.7890 5.7976 6.4160 1.0826 1.0834 1.0682 1.0681 1.0389 1.0357 1.0357 1.0946 1.0995 1.0967 1.0966 1.1000 1.0999 1.0990 1.0988 1.0893 1.0891 1.0923 1.0935 1.0661 1.0661
irintensity: 0.4922 0.2754 3.5942 3.5820 1.1409 2.1151 4.6447 0.5958 1.1811 0.2988 0.4072 0.3110 3.8041 15.8781 41.0135 3.0811 197.0308 5.8348 6.7301 25.8436 0.1577 7.0355 48.0300 18.0510 8.6210 11.6779 3.7355 4.9090 4.8684 4.1033 4.9262 1.1159 55.6546 0.8031 2.1105 0.9673 22.7283 45.6386 0.0132 0.3131 1.0371 98.1427 135.2697 0.7930 0.3286 0.7412 17.9340 2.0018 14.0172 20.2689 64.9091 34.4612 45.4603 0.4288 15.9128 5.6905 0.7510 1.6003 168.4112 2.1209 54.7711 1.2335 1.8805 15.7881 23.6864 1.5088 0.9850 11.3452 39.7225 7.8491 5.6368 1.9427 0.2679 5.7628 0.2347 17.8255 6.7509 12.2164 12.0088 5.2680 1.3723 185.2259 4.1299 42.1393 7.0718 95.5422 0.0552 123.1402 56.3690 29.0874 7.0988 25.8094 18.6937 17.7421 17.6903 21.6133 21.1391 13.1987 50.0713 15.4014 23.8276 32.9593 4.2851 9.1526 4.5385
temp: 298.150 k
press: 1.00000 atm
elementType: 8 8 7 6 6 6 6 6 6 6 6 6 6 6 6 6 1 1 1 1 1 1 1 1 1 1 1 1 1 1 1 1 1 1 1 1 1
symmnumber: 1
zpe: 828312.3 jmol-1
zpe.correction: 0.315488 hartree
zpe.thermalcorrener: 0.333335 hartree
zpe.thermalcorrenthalpy: 0.334279 hartree
zpe.thermalcorrgfe: 0.269883 hartree
zpe.sumelectzpe: -711.888589 hartree
zpe.sumelectthermal: -711.870742 hartree
zpe.sumelectthermalent: -711.869798 hartree
zpe.sumelectthermalfe: -711.934194 hartree
dipole: 1.1491 0.0201 0.0595
dipole: 1.1508
quadrupole: -82.5578 -115.0101 -100.3504
quadrupole: -0.0604 -0.1804 0.7373
quadrupole: 16.7483 -15.7040 -1.0443 -0.0604 -0.1804 0.7373
hfenergy: -712.2040768 hartree
pointgroup: C01 [X(C13H21N1O2)]
dipole: 0.4519878 0.0120438 0.0234519 debye
polarizability: 214.2229066|0.1575247|152.7681813|-0.2781722|-8.9223137|109.4355842 unknown
InChI: InChI=1S/C13H21NO2/c1-10-4-6-13(7-5-10)14(11(2)8-15)12(3)9-16/h4-7,11-12,15-16H,8-9H2,1-3H3
charge 0 multiplicity 1
37 atoms
O  3.133808 -3.040057 0.621462
O  3.094153 3.081975 -0.610836
N  0.914114 0.006126 0.002177
C  1.725271 -1.194657 -0.347777
C  1.703971 1.220499 0.353583
C  -0.508183 -0.004506 -0.00359
C  2.070543 -2.06132 0.901896
C  2.045507 2.088947 -0.895768
C  1.1482 -2.043931 -1.497588
C  1.105051 2.0643 1.496265
C  -1.248804 -1.122506 0.482127
C  -1.261419 1.101062 -0.498989
C  -2.658364 -1.134059 0.458244
C  -2.671004 1.090536 -0.489495
C  -3.405122 -0.026016 -0.015443
C  -4.924096 -0.024389 0.00707
H  2.697845 -0.795599 -0.715853
H  2.679593 0.837558 0.730664
H  2.346502 -1.397271 1.749015
H  1.212608 -2.680803 1.207776
H  2.335136 1.427277 -1.740154
H  1.181315 2.696717 -1.207676
H  1.074365 -1.447622 -2.424175
H  0.14247 -2.430888 -1.26503
H  1.815632 -2.905436 -1.675059
H  1.032522 1.469417 2.423891
H  0.095632 2.435736 1.25442
H  1.758094 2.936118 1.677104
H  -0.720425 -1.98195 0.905134
H  -0.742001 1.963879 -0.926172
H  -3.187988 -2.017765 0.836427
H  -3.210892 1.962465 -0.880457
H  3.97214 -2.555603 0.410279
H  3.936543 2.608763 -0.390459
H  -5.340059 0.600657 -0.803404
H  -5.332424 -1.044318 -0.107822
H  -5.313334 0.378566 0.963012
