program: Gaussian 09
title: 000114384
version: EM64L-G09RevD.01
frameworkgroup: C1[X(C22H26F3NO)]
method: RPBEPBE
basis: SDD
operation: Freq
keyword: #p
keyword: freq=noraman
keyword: PBEPBE/SDD
title: #p freq=noraman PBEPBE/SDD
converged: YES YES NO NO
title: Mulliken charges:
elementType: F F F O N C C C C C C C C C C C C C C C C C C C C C C H H H H H H H H H H H H H H H H H H H H H H H H H H
charge: -0.167323 -0.169524 -0.169531 -0.351797 -0.095890 0.075215 0.174533 0.240178 0.249536 -0.428300 0.432835 -0.431342 -0.719789 -0.700984 -0.373071 -0.425868 -0.363344 -0.382078 -0.389143 -0.249499 -0.235492 -0.350919 -0.369768 0.291594 -0.606564 -0.632315 0.252077 0.257488 0.189919 0.219413 0.241851 0.205994 0.231621 0.234398 0.205112 0.240510 0.225104 0.237401 0.242224 0.191982 0.200767 0.282925 0.231890 0.228555 0.228309 0.259233 0.258211 0.219777 0.187537 0.223208 0.248759 0.188593 0.215793
chargesum: 0.00000
title: Mulliken charges with hydrogens summed into heavy atoms:
elementType: F F F O N C C C C C C C C C C C C C C C C C C C C C C
charge: -0.167323 -0.169524 -0.169531 -0.351797 -0.095890 0.075215 0.174533 0.240178 0.249536 0.019106 0.432835 0.029921 -0.047776 -0.030257 -0.135670 -0.183644 0.029404 -0.099153 -0.157253 -0.020945 -0.007183 -0.091685 -0.111557 0.291594 0.023958 0.020830 0.252077
polarizability: 2.74312251e+02 -2.41395424e+01 2.31628500e+02 -1.05300645e+01 2.95099408e-01 2.30061415e+02
1716.lowfreq: -7.3963 -5.7277 -0.0008 -0.0003 0.0003 5.1806 9.8051 17.8529 23.5343
frequency: 9.7147 17.7505 23.4367 29.3680 38.2427 49.8727 58.2105 77.0225 89.5897 103.7298 107.5009 139.3211 166.0670 183.7336 202.7859 207.0067 220.0064 230.2738 233.7564 250.7426 258.3409 275.8907 287.7968 291.8707 303.6342 333.2236 338.9751 353.8607 365.1588 370.7182 386.9618 404.4160 414.0599 423.3775 459.8662 467.9998 504.0927 514.6238 521.0314 533.3403 555.1970 563.4210 583.2186 610.7576 631.4246 644.4035 679.4246 705.6704 733.3963 743.6511 746.1220 762.6148 764.6680 788.8282 828.0955 841.9393 859.7262 868.8727 882.5296 906.2235 918.7233 925.6515 940.0570 943.9445 967.6454 974.2298 977.7678 986.9688 991.9981 993.8891 996.3481 1018.7811 1025.6543 1028.0824 1033.3365 1046.8924 1058.9876 1069.6287 1084.5864 1091.7824 1098.3709 1117.4693 1126.4982 1138.3394 1145.9020 1154.0184 1172.5845 1186.8315 1189.5408 1196.6366 1203.9802 1243.4954 1252.0100 1267.9467 1274.7796 1283.4213 1291.1722 1295.4595 1304.3689 1307.7667 1357.1587 1367.4602 1371.3958 1371.5701 1388.7023 1390.4222 1406.0898 1417.4241 1440.2262 1442.6157 1451.4468 1457.3051 1462.0519 1462.2862 1464.6967 1467.5839 1474.8224 1476.7111 1479.1805 1481.9286 1485.5020 1491.5562 1501.3150 1580.6151 1598.8763 1614.4473 1622.5581 2834.3277 2845.8541 2861.7308 2978.6527 2982.8881 2986.8941 2995.0848 3000.8454 3016.2815 3026.1431 3045.7592 3063.9599 3075.3916 3078.5659 3085.3596 3086.1980 3095.2291 3099.2769 3124.0183 3132.1426 3140.1355 3145.8660 3156.8060 3163.6649 3164.6494 3184.9595
redmass: 15.8363 3.6436 5.3590 4.0823 4.1544 3.7582 2.8159 4.3628 4.0101 4.7103 4.3556 4.8763 3.9179 4.7040 1.1451 2.1475 1.9708 2.8418 1.3718 1.3609 1.9841 1.9711 2.6228 2.4523 2.4523 3.6658 3.1238 3.4114 2.6128 6.0653 5.5067 2.9204 2.1675 4.2630 5.4523 3.8419 3.6498 9.8451 4.8548 3.8961 3.4979 4.1818 3.9305 6.2015 6.9051 4.0552 5.0104 5.7214 2.0157 3.8454 5.1857 1.9776 1.9465 2.5116 2.2261 1.7471 1.4180 1.4326 1.9159 2.9403 1.5973 2.9279 2.6874 1.4039 1.6003 2.4848 4.9567 1.3308 2.0805 1.4078 2.3589 5.8910 2.3500 3.2299 1.5303 4.0015 2.2011 2.0680 2.1325 1.5801 2.0290 1.7309 1.5170 1.4819 1.5705 1.8148 1.1108 1.7842 2.9064 1.9192 1.7018 2.2121 1.8928 1.8606 1.6619 3.7130 1.4758 1.6698 1.3468 1.6876 1.5154 1.3400 1.5549 2.8300 1.2362 7.1069 3.7569 1.1423 1.1640 2.2515 1.0525 1.0527 1.0618 1.0658 1.4947 1.1913 1.1101 1.0938 1.2265 1.1270 1.0615 1.0625 2.6396 7.4562 7.3928 6.8300 6.4335 1.0692 1.0575 1.0578 1.0647 1.0350 1.0353 1.0636 1.0864 1.0722 1.0725 1.0935 1.1008 1.1009 1.0994 1.0995 1.0992 1.1012 1.1007 1.0860 1.0887 1.0881 1.0939 1.0899 1.0995 1.0969 1.0945
irintensity: 0.0364 0.2851 0.1895 0.4845 0.4045 0.2143 0.6222 0.1643 0.1738 1.5763 0.0602 1.5673 0.3884 0.5696 0.0689 0.4933 0.0600 0.2648 0.8414 0.7743 2.0589 0.5434 0.0452 0.5741 6.8896 3.0587 0.7755 4.7624 4.2237 2.4476 1.3047 0.0279 3.8937 8.8591 0.4197 11.4971 22.3147 0.4402 1.7553 0.7059 4.9466 13.0761 1.0718 7.7556 0.8689 16.6984 2.4179 2.5522 10.5881 0.7530 6.6104 31.3328 34.3308 19.0877 25.9311 48.0056 15.3902 5.3256 19.0139 47.6349 1.5229 8.4501 51.1949 1.1973 31.0553 86.8615 176.2769 0.8317 44.9675 6.0124 64.4641 154.2098 20.1412 50.7454 17.4822 8.5096 1.7661 6.1863 12.5284 7.7792 10.9791 19.7893 4.1535 5.0198 24.5210 6.7370 0.7933 13.3869 9.3333 2.6696 26.4455 13.0784 18.1624 28.1639 9.9542 362.8084 20.6621 16.8225 14.6460 15.8687 1.2079 6.1911 25.7887 5.7351 16.0116 2.8738 13.4132 2.7532 3.9646 17.2078 1.2286 10.2051 4.8456 4.0557 6.3830 8.7595 16.9117 5.3694 21.7344 19.8945 14.4746 8.4040 0.1830 1.1533 0.1172 17.5579 39.6140 58.3249 70.9860 295.7104 18.6650 16.7308 23.1165 29.4064 29.6856 41.3039 34.3183 7.2228 40.9327 37.8213 5.5407 35.8868 46.1997 12.0359 38.6501 4.5116 5.9704 10.5258 24.1033 1.6807 19.4418 13.8469 2.0358
temp: 298.150 k
press: 1.00000 atm
elementType: 9 9 9 8 7 6 6 6 6 6 6 6 6 6 6 6 6 6 6 6 6 6 6 6 6 6 6 1 1 1 1 1 1 1 1 1 1 1 1 1 1 1 1 1 1 1 1 1 1 1 1 1 1
symmnumber: 1
zpe: 1125505.0 jmol-1
zpe.correction: 0.428682 hartree
zpe.thermalcorrener: 0.455537 hartree
zpe.thermalcorrenthalpy: 0.456481 hartree
zpe.thermalcorrgfe: 0.368479 hartree
zpe.sumelectzpe: -1281.429336 hartree
zpe.sumelectthermal: -1281.402482 hartree
zpe.sumelectthermalent: -1281.401537 hartree
zpe.sumelectthermalfe: -1281.489539 hartree
dipole: -5.5284 1.1142 -0.6723
dipole: 5.6795
quadrupole: -183.5560 -150.7127 -149.3905
quadrupole: 1.5236 -4.4804 3.3278
quadrupole: -22.3362 10.5070 11.8292 1.5236 -4.4804 3.3278
hfenergy: -1281.8580183 hartree
pointgroup: C01 [X(C22H26F3N1O1)]
dipole: 2.2070932 -0.2552011 -0.2379104 debye
polarizability: 277.7868229|-20.2205405|227.9006096|11.1248983|0.3541582|230.3147336 unknown
InChI: InChI=1S/C22H26F3NO/c1-20(2)18-8-5-6-9-19(18)21(27-20,14-7-15-26(3)4)16-10-12-17(13-11-16)22(23,24)25/h5-6,8-13H,7,14-15H2,1-4H3
charge 0 multiplicity 1
53 atoms
F  -5.792528 -0.554596 1.065786
F  -5.636755 1.606508 0.409149
F  -5.799202 -0.029454 -1.146069
O  1.17514 -0.218734 1.37255
N  3.409268 3.347608 -0.27084
C  0.672065 -0.09211 -0.030439
C  2.115842 -1.388655 1.51859
C  1.14186 -1.39241 -0.693247
C  1.980922 -2.110882 0.185146
C  1.349778 1.147421 -0.68513
C  -0.862096 0.024638 0.011228
C  1.052166 2.474312 0.041277
C  1.619157 -2.224565 2.715434
C  3.540956 -0.842568 1.761869
C  0.872493 -1.879164 -1.987259
C  2.570805 -3.325541 -0.216193
C  1.960793 3.622457 -0.450163
C  -1.580192 -0.287837 1.190878
C  -1.590409 0.41797 -1.142489
C  1.460372 -3.100032 -2.395453
C  2.305894 -3.81921 -1.515936
C  -2.987046 -0.217947 1.22208
C  -2.996194 0.487351 -1.123352
C  -3.698199 0.164246 0.061582
C  4.248534 4.287775 -1.041397
C  3.815951 3.291444 1.148573
C  -5.191222 0.284771 0.096797
H  2.442321 0.982543 -0.685535
H  1.045188 1.216087 -1.749429
H  -0.001472 2.777437 -0.115975
H  1.174466 2.320389 1.129064
H  2.296033 -3.078611 2.901605
H  1.592379 -1.598863 3.624911
H  0.606226 -2.617588 2.52353
H  4.263916 -1.673033 1.864235
H  3.861446 -0.200374 0.924024
H  3.560702 -0.245391 2.690658
H  0.2103 -1.335574 -2.669815
H  3.222546 -3.885301 0.464679
H  1.66036 4.571209 0.06814
H  1.788619 3.781358 -1.533489
H  -1.014953 -0.569451 2.082271
H  -1.063153 0.6843 -2.064394
H  1.256863 -3.493822 -3.397304
H  2.753659 -4.764076 -1.843186
H  -3.531312 -0.466525 2.138605
H  -3.54632 0.782842 -2.022256
H  5.311744 4.001366 -0.947454
H  4.149424 5.352015 -0.705027
H  3.975056 4.241698 -2.110842
H  3.263596 2.495218 1.675186
H  3.639496 4.255199 1.692606
H  4.893614 3.055651 1.212816
