program: Gaussian 09
title: 000114302
version: EM64L-G09RevD.01
frameworkgroup: C1[X(C8H6ClNO)]
method: RPBEPBE
basis: SDD
operation: Freq
keyword: #p
keyword: freq=noraman
keyword: PBEPBE/SDD
title: #p freq=noraman PBEPBE/SDD
converged: NO NO NO NO
title: Mulliken charges:
elementType: Cl O N C C C C C C C C H H H H H H
charge: -0.053658 -0.252533 -0.071639 0.271346 0.015491 0.226235 -0.347561 -0.309225 -0.078968 -0.201424 -0.758155 0.280326 0.260644 0.257936 0.249924 0.249930 0.261331
chargesum: 0.00000
title: Mulliken charges with hydrogens summed into heavy atoms:
elementType: Cl O N C C C C C C C C
charge: -0.053658 -0.252533 -0.071639 0.271346 0.015491 0.226235 -0.067234 -0.048581 -0.078968 0.056513 0.003030
polarizability: 1.68363670e+02 3.17466318e+00 9.82296813e+01 -1.93885184e-02 -2.32901184e-03 4.51372190e+01
1716.lowfreq: -0.0035 -0.0026 -0.0012 3.4805 8.4732 21.4057 90.9466 105.9146 180.8065
frequency: 90.9441 105.8929 180.8055 187.1644 271.4805 295.8347 341.7132 345.3005 426.1991 470.1844 536.4523 590.2482 627.7629 667.5765 676.0341 745.7692 810.5214 822.7541 832.1640 863.6381 878.1703 953.0138 1002.3381 1040.9281 1048.2520 1100.5636 1136.4123 1195.8141 1223.8909 1260.0734 1375.7050 1399.5544 1425.7515 1439.3181 1453.9511 1458.6615 1551.8883 1605.6379 1617.7302 2997.3296 3076.0393 3132.5597 3164.2864 3183.2792 3189.3734
redmass: 5.4590 1.0518 4.6565 5.5247 5.9340 4.0158 11.9977 5.8909 2.9306 4.4474 5.6434 4.5680 5.1184 5.7570 8.4945 4.3807 5.6450 1.4647 6.9618 1.4045 7.8681 1.3365 2.0818 1.9036 1.4924 3.1746 1.8585 3.2342 2.5596 1.7622 4.3239 1.2484 4.6014 3.0035 1.0439 1.1250 7.2052 9.0210 8.3085 1.0381 1.0975 1.0986 1.0888 1.0975 1.0946
irintensity: 0.5289 0.4799 4.7226 0.6680 0.0035 5.0013 3.9516 1.4772 9.6540 2.0404 5.9016 7.6651 0.1319 3.8758 13.0338 0.4174 56.0389 48.9861 9.8762 29.5829 65.6524 0.6767 3.6039 26.1345 5.2594 1.7149 16.1894 32.8633 22.3253 13.6149 12.8389 19.3585 24.1445 68.6802 19.0660 16.6256 60.3538 18.6562 33.9556 10.2227 8.6159 3.9136 0.7291 2.7428 0.8946
temp: 298.150 k
press: 1.00000 atm
elementType: 17 8 7 6 6 6 6 6 6 6 6 1 1 1 1 1 1
symmnumber: 1
zpe: 315807.9 jmol-1
zpe.correction: 0.120285 hartree
zpe.thermalcorrener: 0.129393 hartree
zpe.thermalcorrenthalpy: 0.130338 hartree
zpe.thermalcorrgfe: 0.085494 hartree
zpe.sumelectzpe: -897.710160 hartree
zpe.sumelectthermal: -897.701051 hartree
zpe.sumelectthermalent: -897.700107 hartree
zpe.sumelectthermalfe: -897.744951 hartree
dipole: -1.7584 -0.3715 0.0004
dipole: 1.7972
quadrupole: -65.4191 -67.6599 -72.0660
quadrupole: 6.8728 -0.0017 -0.0011
quadrupole: 2.9625 0.7217 -3.6843 6.8728 -0.0017 -0.0011
hfenergy: -897.8304447 hartree
pointgroup: C01 [X(C8H6Cl1N1O1)]
dipole: -0.6980675 -0.1124587 0.0001683 debye
dipolederiv: -0.7941131 0.1955285 0.0001001 0.2636899 -0.2008092 -0.000036 0.0000969 -0.0000246 -0.0650599 -0.9799398 0.1460234 0.0000895 0.0050213 -0.6045789 -0.0000113 0.0001214 -0.0000307 -0.1098941 -0.5685664 -0.1843982 0.0000324 -0.1616879 -0.4912809 0.0000354 0.0000554 0.000029 -0.2360599 0.4449019 0.0429397 -0.0000145 0.3910942 0.1162618 -0.0000339 -0.0000125 -0.000004 0.0804897 0.3295865 0.0745757 -0.000028 -0.1426117 -0.0875392 0.0000154 -0.0000259 0.0000135 0.0214004 0.9253837 -0.0128634 -0.0001569 -0.0700373 0.8304856 -0.0000131 -0.0003878 -0.0000759 0.0592168 -0.2886657 0.0036322 0.0000111 0.0129825 -0.0459576 -0.0000058 0.0000223 -0.0000046 -0.1192559 0.1410366 -0.0366268 -0.0000434 0.0506956 0.1337054 -0.0000161 -0.0000521 -0.0000033 -0.1231707 1.0667292 -0.2946057 -0.0001523 -0.467243 0.3175079 0.0000712 -0.0001558 0.0000345 -0.0759227 -0.3112545 0.1401666 0.0000335 0.2622615 -0.1056247 -0.0000423 0.0000265 -0.0000151 -0.1327053 -0.2310973 -0.0379369 0.0000275 -0.1537353 -0.0238857 0.0000337 0.0004172 0.00012 0.0570986 0.0938635 0.0143584 0.0000124 0.0229666 0.0182782 -0.0000015 0.000016 -0.0000018 0.1917023 0.0801995 0.0365239 0.0000098 0.0117725 -0.0349329 0.0000015 0.0000155 0.0000023 0.1708064 -0.0019685 -0.0730472 0.0000226 -0.0592139 0.0563007 0.0000081 0.000022 0.0000076 0.1711603 0.0245482 -0.0235052 -0.0035376 -0.0356543 0.0690514 -0.0946861 -0.06206 -0.0952876 -0.0120941 0.0243952 -0.0235781 0.0036365 -0.0356425 0.069396 0.0945124 0.0620657 0.0951188 -0.0124685 0.044961 0.032813 -0.0000426 0.1053417 -0.0163778 0.0001686 -0.0001648 0.0001219 0.1347566 unknown
polarizability: 168.5062904|-0.2357943|98.0870608|-0.0194786|-0.0013865|45.137219 unknown
InChI: InChI=1S/C8H6ClNO/c1-5-10-7-3-2-6(9)4-8(7)11-5/h2-4H,1H3
charge 0 multiplicity 1
17 atoms
Cl 3.899069 -0.897158 -0.000353
O  -1.39987 -1.23414 0.000312
N  -1.784615 1.056331 0.000345
C  -0.142145 -0.587867 0.000179
C  -0.379723 0.818283 0.000184
C  -2.342199 -0.145921 0.000475
C  1.128911 -1.172039 0.000021
C  0.712766 1.709149 0.000043
C  2.195903 -0.248618 -0.000125
C  2.013519 1.158797 -0.000121
C  -3.784821 -0.51191 0.000719
H  1.289743 -2.25219 0.000007
H  0.55865 2.791455 0.000044
H  2.891136 1.811433 -0.000236
H  -4.041741 -1.114659 -0.8890
H  -4.04192 -1.11286 0.891625
H  -4.385263 0.409813 -0.000217
