program: Gaussian 09
title: 000114294
version: EM64L-G09RevD.01
frameworkgroup: C1[X(C17H16NO)]
method: RPBEPBE
basis: SDD
operation: Freq
keyword: #p
keyword: freq=noraman
keyword: PBEPBE/SDD
title: #p freq=noraman PBEPBE/SDD
converged: YES YES NO NO
title: Mulliken charges:
elementType: O N C C C C C C C C C C C C C C C C C H H H H H H H H H H H H H H H H
charge: -0.235228 -0.118003 0.260567 -0.597840 0.396971 0.515394 -0.170793 -0.274980 -0.264750 -0.510800 -0.195745 0.335944 -0.346293 -0.356994 -0.432999 -0.217422 -0.213037 -0.225871 -0.530661 0.253624 0.273547 0.277966 0.281627 0.283679 0.287139 0.271793 0.273946 0.230201 0.244131 0.248131 0.250898 0.254490 0.275360 0.238201 0.237808
chargesum: 1.00000
title: Mulliken charges with hydrogens summed into heavy atoms:
elementType: O N C C C C C C C C C C C C C C C C C
charge: -0.235228 -0.118003 0.260567 -0.070670 0.396971 0.515394 0.107173 0.006647 0.018929 -0.223661 0.076047 0.335944 -0.072347 -0.126794 -0.188868 0.030709 0.037861 0.028620 0.220708
polarizability: 2.20490905e+02 1.29593699e+01 2.35174240e+02 -7.49079056e+00 1.53877814e+01 1.30741432e+02
1716.lowfreq: -10.0393 -0.0007 -0.0006 -0.0004 5.0758 7.3297 21.7858 37.6553 51.2967
frequency: 20.5685 37.6199 51.2925 79.5789 111.1417 156.5688 160.5150 198.0368 209.9042 238.5931 280.5210 303.7117 320.9232 343.5152 400.1467 411.4093 444.1764 459.7605 490.6966 510.5644 537.1714 538.3675 580.7183 615.3466 622.6266 643.8879 679.4669 701.9797 716.2529 747.9481 757.2346 799.6311 813.3185 826.8235 834.7842 852.0722 888.8728 892.9892 917.1837 938.9182 957.5231 966.1786 983.0006 987.6784 990.1967 998.5465 1011.1046 1025.9125 1029.8317 1085.9324 1100.1854 1110.3495 1146.0099 1164.0179 1175.8554 1182.4059 1194.4082 1201.4022 1205.7478 1222.3796 1235.5778 1283.7994 1290.2898 1312.8121 1347.6853 1375.0982 1386.7270 1397.3608 1420.2949 1436.1334 1444.7781 1453.9503 1463.8606 1470.2795 1474.3240 1482.3490 1490.7311 1526.5857 1576.2413 1586.1674 1597.2338 1611.4615 1630.6607 2985.4023 3022.9232 3078.9799 3086.6398 3115.5174 3121.4387 3148.8843 3154.1229 3160.1880 3163.7334 3171.2759 3171.7324 3177.3132 3186.6876 3196.4506 3204.3831
redmass: 4.1211 4.5128 4.2578 3.6225 3.8696 4.1189 3.9949 1.4329 2.3499 3.8319 4.4198 4.5046 3.0577 4.3756 2.7915 3.4523 2.6620 4.0127 2.8885 6.0279 4.5250 4.4409 5.7635 5.8356 3.6054 3.5692 4.9377 2.5341 2.9809 2.4674 1.9478 1.9586 1.5564 2.4346 4.6204 1.2516 1.6481 4.4048 1.3682 1.4411 1.3625 2.0170 1.4197 4.0261 5.4983 1.3812 1.3470 2.4801 3.6669 1.8694 1.8367 1.2519 1.3761 1.7328 1.2444 1.0589 1.1158 1.6706 1.9800 1.4277 1.8706 2.3584 1.8928 1.3646 1.3092 2.1531 5.6073 3.3914 3.4470 1.2337 2.1528 2.5082 1.1529 2.1843 1.0492 1.8242 1.4236 3.4178 6.2436 5.4599 5.9700 5.9441 6.4299 1.0323 1.0599 1.1047 1.1058 1.0901 1.0892 1.0892 1.1010 1.0951 1.0922 1.0895 1.0932 1.1013 1.0922 1.0955 1.1001
irintensity: 0.1113 0.3321 0.5418 4.0936 4.6048 2.9727 1.5325 0.3927 0.2482 2.4155 0.6680 5.0493 6.5510 0.9399 0.3287 1.8614 6.7970 4.2105 14.3303 3.0919 0.1322 21.2805 2.5045 0.2440 4.5641 5.2637 2.6753 16.4226 41.9504 17.8476 46.8905 17.5760 55.8440 11.0984 6.0186 0.8753 36.9376 21.0546 2.8129 4.0779 1.4652 1.0756 1.0179 30.7274 10.6881 1.1225 0.7503 13.3820 22.5248 4.8172 16.1130 0.0036 0.9418 28.8119 50.8360 0.5645 2.1675 27.9181 14.5374 26.1821 15.5044 119.0854 140.1940 4.6866 1.9373 9.3348 7.9547 17.3259 15.1584 22.7548 9.5210 6.5890 81.5207 16.9850 20.9532 31.7300 10.7229 163.1344 24.1870 27.2140 6.6267 1.1325 123.4325 39.6566 12.4903 1.7059 26.6671 7.5517 10.4219 1.2172 7.5228 13.2123 0.1679 0.3906 0.5725 8.6996 1.6806 0.7323 1.5968
temp: 298.150 k
press: 1.00000 atm
elementType: 8 7 6 6 6 6 6 6 6 6 6 6 6 6 6 6 6 6 6 1 1 1 1 1 1 1 1 1 1 1 1 1 1 1 1
symmnumber: 1
zpe: 749541.7 jmol-1
zpe.correction: 0.285485 hartree
zpe.thermalcorrener: 0.301277 hartree
zpe.thermalcorrenthalpy: 0.302222 hartree
zpe.thermalcorrgfe: 0.240934 hartree
zpe.sumelectzpe: -785.827189 hartree
zpe.sumelectthermal: -785.811397 hartree
zpe.sumelectthermalent: -785.810453 hartree
zpe.sumelectthermalfe: -785.871740 hartree
dipole: -0.9850 1.7768 -1.2959
dipole: 2.4097
quadrupole: -74.7898 -64.1153 -100.7369
quadrupole: 5.8549 -1.1407 4.4930
quadrupole: 5.0909 15.7654 -20.8562 5.8549 -1.1407 4.4930
hfenergy: -786.1126746 hartree
pointgroup: C01 [X(C17H16N1O1)]
dipole: 0.3965694 0.6576492 0.5558996 debye
polarizability: 220.1959288|-12.6308894|236.7579982|-11.0690739|-6.1422181|129.4526506 unknown
InChI: InChI=1S/C17H16NO/c1-19-16-9-10-17-15(12-16)8-5-11-18(17)13-14-6-3-2-4-7-14/h2-12H,13H2,1H3
charge 1 multiplicity 1
35 atoms
O  4.207533 -1.416386 -0.639232
N  -0.451569 1.390119 0.823117
C  0.679987 0.636776 0.462923
C  -1.637242 0.726607 1.483019
C  1.800303 1.321765 -0.158596
C  -2.434808 -0.182332 0.553853
C  -0.514261 2.731261 0.585716
C  0.765592 -0.763861 0.69806
C  1.702734 2.730988 -0.397243
C  2.961721 0.586288 -0.511317
C  0.550104 3.427898 -0.028693
C  3.035891 -0.795817 -0.264231
C  1.919641 -1.466511 0.343806
C  -2.798143 0.236554 -0.749842
C  -2.876917 -1.440588 1.031609
C  -3.590571 -0.598008 -1.567616
C  -3.678249 -2.270515 0.216094
C  -4.033312 -1.852302 -1.086511
C  4.367965 -2.868717 -0.416116
H  -2.270563 1.548362 1.860866
H  -1.27078 0.169445 2.362608
H  -1.427088 3.24116 0.900849
H  -0.072135 -1.31303 1.130353
H  2.541308 3.25384 -0.86821
H  3.814306 1.08764 -0.978495
H  0.447932 4.501626 -0.19722
H  1.960107 -2.543089 0.531252
H  -2.470234 1.209941 -1.135747
H  -2.615488 -1.768258 2.046373
H  -3.868068 -0.269409 -2.574428
H  -4.024156 -3.237291 0.595799
H  -4.652505 -2.495515 -1.719928
H  5.372844 -3.095295 -0.795766
H  3.613823 -3.440234 -0.98694
H  4.310701 -3.10991 0.660832
