program: Gaussian 09
title: 000014293
version: EM64L-G09RevD.01
frameworkgroup: C1[X(C5H3Cl2NO2)]
method: RPBEPBE
basis: SDD
operation: Freq
keyword: #p
keyword: freq=noraman
keyword: PBEPBE/SDD
title: #p freq=noraman PBEPBE/SDD
converged: NO NO NO NO
title: Mulliken charges:
elementType: Cl Cl O O N C C C C C H H H
charge: 0.082277 0.082827 -0.172682 -0.171701 -0.202558 0.248376 0.261280 -0.154129 -0.154733 -0.592996 0.256185 0.262546 0.255307
chargesum: 0.00000
title: Mulliken charges with hydrogens summed into heavy atoms:
elementType: Cl Cl O O N C C C C C
charge: 0.082277 0.082827 -0.172682 -0.171701 -0.202558 0.248376 0.261280 -0.154129 -0.154733 0.181041
polarizability: 9.89520501e+01 9.16126457e-01 1.18752071e+02 -1.63785976e-01 1.90023077e-02 3.72535735e+01
1716.lowfreq: -10.0621 -0.0026 0.0006 0.0022 7.9839 8.6299 88.5177 95.9188 119.5275
frequency: 88.3821 95.9139 119.5264 147.5012 171.3909 205.2515 256.8977 259.3049 327.3230 385.4651 438.2914 450.2485 594.7524 708.6551 716.3489 732.0104 833.9176 847.7117 979.1802 1101.7963 1128.0909 1143.4323 1231.8180 1353.7614 1439.3241 1469.6197 1485.1871 1600.5220 1631.6876 1685.0477 3003.4051 3096.1289 3124.1809
redmass: 1.1320 7.3713 4.2433 28.3344 9.6418 7.9999 7.2520 3.9104 17.3239 20.5923 7.9377 12.3597 12.5426 7.6373 10.8859 12.0762 10.0339 8.6080 2.6155 10.7646 1.3019 11.2872 2.4625 6.2993 1.2509 1.0435 1.0638 12.0136 12.2948 11.5491 1.0331 1.1028 1.1017
irintensity: 0.0454 0.0259 7.9301 0.0464 2.0429 0.1156 0.9551 2.4880 3.8877 0.0038 31.8915 0.0003 0.0039 0.1593 23.3838 0.1035 47.9325 24.1335 75.3596 4.1284 0.4610 92.7460 9.4592 178.8857 74.0454 18.1653 7.6911 109.8613 476.6079 6.9851 27.5460 15.1510 0.8263
temp: 298.150 k
press: 1.00000 atm
elementType: 17 17 8 8 7 6 6 6 6 6 1 1 1
symmnumber: 1
zpe: 196499.0 jmol-1
zpe.correction: 0.074843 hartree
zpe.thermalcorrener: 0.084649 hartree
zpe.thermalcorrenthalpy: 0.085594 hartree
zpe.thermalcorrgfe: 0.038519 hartree
zpe.sumelectzpe: -1316.912515 hartree
zpe.sumelectthermal: -1316.902708 hartree
zpe.sumelectthermalent: -1316.901764 hartree
zpe.sumelectthermalfe: -1316.948839 hartree
dipole: -0.8514 0.0217 0.0052
dipole: 0.8517
quadrupole: -61.9709 -85.0525 -68.7365
quadrupole: -0.1807 -0.0002 0.0050
quadrupole: 9.9491 -13.1325 3.1834 -0.1807 -0.0002 0.0050
hfenergy: -1316.9873579 hartree
pointgroup: C01 [X(C5H3Cl2N1O2)]
dipole: -0.3348578 0.0120648 0.0020316 debye
dipolederiv: -0.4172119 -0.4116536 0.0001734 -0.301373 -0.2981652 0.0002887 0.0005541 0.0005886 0.0505644 -0.3994112 0.4128838 -0.0000827 0.3043528 -0.31376 -0.0000592 0.0003483 -0.0004262 0.0494321 -0.5049818 0.2943564 0.000185 0.0531512 -1.0002746 0.0009851 -0.0012317 0.0009165 -0.3115639 -0.5005322 -0.3117797 0.0004041 -0.0680094 -0.9708236 -0.0004162 -0.0002825 -0.0006943 -0.3113055 -1.0597431 -0.0239776 0.0051869 0.0195662 -0.991604 -0.0000185 -0.009386 0.0004563 -0.2038771 1.0188919 -0.2574708 -0.0012852 0.0687251 1.3665318 -0.0012412 0.0006328 -0.0016938 0.2843822 1.0120886 0.2906624 -0.0017278 -0.0449538 1.3440916 0.0004538 0.000841 0.000538 0.2937959 0.1402795 0.9504775 -0.0001735 0.8305579 0.3208361 -0.0018031 -0.0002328 -0.0000606 -0.0651986 0.097665 -0.9502971 0.0005201 -0.8237764 0.355994 0.0015699 -0.0000177 0.000042 -0.0678853 0.5205324 0.0420247 -0.0113689 -0.0043432 0.0531922 0.0014618 -0.0089842 0.0016354 0.2156173 0.0030242 -0.0066342 -0.0149731 -0.0737477 0.0669506 -0.0962913 -0.0648226 -0.0650899 -0.0185391 0.1005973 -0.0213601 0.0017526 0.1002346 -0.0157531 0.0144462 0.0005789 0.0096248 0.1321571 -0.0111987 -0.0072317 0.021389 -0.0603841 0.0827844 0.0806241 0.0820026 0.0541632 -0.0475795 unknown
polarizability: 98.97354|1.124355|118.7305876|-0.1635502|-0.004502|37.2535665 unknown
InChI: InChI=1S/C5H3Cl2NO2/c1-8-4(9)2(6)3(7)5(8)10/h1H3
charge 0 multiplicity 1
13 atoms
Cl 2.373833 1.768179 -0.001147
Cl 2.326749 -1.837641 -0.000099
O  -0.82792 2.356717 -0.003297
O  -0.892423 -2.340988 -0.001562
N  -1.243923 0.011902 -0.001704
C  -0.428383 1.171919 -0.000489
C  -0.45943 -1.167932 -0.000029
C  1.002743 0.664288 0.000227
C  0.984927 -0.698514 0.000578
C  -2.711285 0.027103 0.000977
H  -3.101363 -0.545616 -0.857152
H  -3.033104 1.077824 -0.07419
H  -3.104221 -0.414239 0.932986
