program: Gaussian 09
title: 000114199
version: EM64L-G09RevD.01
frameworkgroup: C1[X(C21H31NO)]
method: RPBEPBE
basis: SDD
operation: Freq
keyword: #p
keyword: freq=noraman
keyword: PBEPBE/SDD
title: #p freq=noraman PBEPBE/SDD
converged: YES YES NO NO
title: Mulliken charges:
elementType: O N C C C C C C C C C C C C C C C C C C C C C H H H H H H H H H H H H H H H H H H H H H H H H H H H H H H H
charge: -0.439013 -0.099666 0.212843 -0.149463 -0.064114 -0.584627 -0.547814 -0.462537 0.303394 -0.633037 -0.374391 -0.390447 -0.406355 0.297847 -0.436503 -0.586368 -0.400212 -0.394100 0.264855 -0.423549 0.000809 -0.728400 -0.717381 0.226729 0.257886 0.229126 0.241730 0.200582 0.202868 0.192584 0.228844 0.225936 0.229293 0.219517 0.183762 0.218855 0.190263 0.185468 0.201366 0.173490 0.213572 0.255682 0.235864 0.200084 0.190061 0.219743 0.224151 0.228675 0.198797 0.209264 0.211797 0.201256 0.208187 0.352798
chargesum: 0.00000
title: Mulliken charges with hydrogens summed into heavy atoms:
elementType: O N C C C C C C C C C C C C C C C C C C C C C
charge: -0.086216 -0.099666 0.212843 0.077266 0.193773 -0.113770 -0.144364 -0.041110 0.303394 -0.177808 0.028888 0.018671 -0.019521 0.297847 -0.049441 -0.330687 -0.164348 -0.003955 0.264855 -0.203806 0.224960 -0.091665 -0.096141
polarizability: 2.76053276e+02 1.41170087e+01 2.28182763e+02 -8.82884634e+00 1.47907736e+01 1.86679868e+02
1716.lowfreq: -5.9069 -0.0002 0.0003 0.0005 3.8497 11.3867 29.3681 38.6444 50.0355
frequency: 29.1233 38.4388 49.8290 65.6466 101.0488 108.1347 122.6352 157.2364 176.9123 201.5243 208.5599 232.4652 240.7759 250.6142 277.5272 288.5054 295.3044 317.2334 326.7388 354.5076 356.2630 367.9117 382.3815 386.5636 407.0923 417.6589 435.6544 449.0473 463.9054 481.0029 493.5107 507.5514 529.0620 536.2855 565.6939 580.8551 616.7187 651.2443 678.8745 707.4183 721.1550 759.4512 767.8657 789.8006 794.9909 803.2808 831.4790 842.2429 849.4399 875.6361 893.7113 895.2385 908.8785 916.4624 918.1803 921.4440 925.3317 935.1692 949.9751 954.5812 973.5020 997.0380 1001.3087 1011.9277 1033.9165 1042.0106 1045.1080 1079.6202 1094.8911 1110.1346 1119.5626 1123.9063 1130.6094 1134.9628 1144.4549 1149.4088 1156.8321 1162.2669 1171.9349 1176.6266 1183.6739 1197.6018 1206.5642 1214.8048 1230.3813 1235.5008 1244.6233 1250.8962 1258.6727 1265.1403 1281.1978 1296.8294 1300.5373 1308.4423 1323.0019 1325.3237 1329.8823 1340.1530 1343.3707 1345.6476 1347.1414 1353.3156 1372.3166 1376.2816 1386.9172 1394.2515 1416.3550 1430.5137 1453.0277 1458.4065 1465.5863 1466.4025 1467.0803 1469.5438 1471.0659 1471.5776 1476.8490 1478.4646 1479.5996 1482.4765 1491.0125 1496.9106 1569.0531 1623.7754 1637.1093 2828.4169 2925.0180 2958.5799 2959.6523 2960.9818 2961.9995 2967.2997 2977.5173 2977.9847 2980.5764 2982.4974 2984.3600 2989.6079 3001.9570 3009.3259 3016.5973 3019.6218 3022.4836 3024.3812 3037.3633 3038.5921 3046.5546 3048.2043 3051.5580 3058.7626 3063.9983 3075.7157 3109.4047 3133.1701 3155.8235 3582.6625
redmass: 3.2769 3.5906 3.0650 4.6389 3.7152 3.7632 3.1218 2.9484 2.6691 1.0629 2.6694 2.9276 1.6174 2.2692 2.5077 2.5648 2.3033 2.4250 2.4246 2.0584 1.1709 2.8647 2.5409 3.0397 2.4643 2.5764 3.2257 3.2783 3.2908 4.0738 3.4887 2.4068 3.1945 2.6416 3.3524 3.0835 3.1592 3.0489 5.3613 4.3060 3.7421 2.1065 2.4708 1.8948 1.4120 2.5645 2.2397 2.4685 2.0775 2.1849 1.6808 2.3483 2.0077 1.4689 1.5000 1.5154 2.3085 1.9080 1.4040 2.0031 2.6579 2.2437 2.1299 1.9744 1.9481 3.0881 2.1136 1.4895 1.9184 2.1227 1.8963 1.6360 2.1673 1.5003 2.0217 1.4619 1.7539 1.7696 1.7457 1.5400 1.6459 2.6272 1.4060 1.4809 2.1563 1.4915 1.7283 1.3861 1.4416 1.3790 1.5185 1.4121 1.4372 1.3369 1.4022 1.2994 1.3323 1.4253 1.4082 1.4403 3.6391 1.5030 1.3395 1.2433 1.1961 1.2205 1.2619 2.9533 1.0836 1.1237 1.3592 1.0813 1.0617 1.2769 1.0665 1.1065 1.0629 1.4239 1.0961 1.0629 1.0727 1.0653 5.5541 4.3505 1.1799 1.0710 1.0687 1.0537 1.0626 1.0396 1.0620 1.0397 1.0627 1.0664 1.0644 1.0751 1.0602 1.0845 1.0879 1.0931 1.0977 1.0858 1.0924 1.0959 1.1025 1.1022 1.1000 1.1011 1.0989 1.0991 1.0984 1.0979 1.0871 1.0965 1.0904 1.0660
irintensity: 0.0067 0.0091 0.0436 0.2365 0.6975 0.8014 1.0956 0.8533 0.3563 0.0418 0.8735 1.9222 0.5996 0.5873 1.1808 0.3516 0.0921 1.7517 0.7948 12.9258 119.2354 1.7147 1.5089 5.7226 0.8288 2.3323 0.9312 1.5891 8.5075 4.0880 8.2821 0.9943 2.3537 1.5397 5.2785 5.5894 6.9429 7.2358 0.3008 6.6571 1.5053 3.2380 3.0248 6.4160 44.0252 2.7505 12.0836 4.4086 24.5370 12.3753 9.2457 13.2171 1.2476 0.9057 8.5339 3.7333 6.5012 1.7039 0.4474 1.2512 19.3365 5.3240 6.5408 4.3722 4.4588 2.3434 0.2561 0.6234 5.0327 8.4223 13.4129 3.6209 2.8824 3.4306 0.7686 113.9137 50.3510 60.4675 8.2812 17.7565 10.3433 6.0503 3.8223 5.2848 2.8267 2.6618 19.7279 3.7223 1.9146 3.1328 24.7682 14.4066 7.7587 1.1356 3.3071 17.5318 3.2064 1.9045 1.3381 0.3652 33.5511 2.4019 8.0413 19.5353 6.9106 21.7940 11.2589 2.8330 8.5310 8.9725 2.3732 4.0597 1.0291 25.9420 0.5591 18.3362 6.6284 17.1491 9.3489 7.7075 13.6970 9.0572 67.8908 44.0991 17.5611 88.8865 47.7554 26.3855 36.1612 49.0497 22.8910 37.0545 49.9155 2.2840 28.9176 44.7221 58.5982 2.0336 12.3048 39.2097 44.2141 80.5296 31.2204 61.2858 13.7863 24.9689 38.9355 94.7177 19.7781 60.9453 89.7999 53.3338 15.7264 23.6850 4.5711 37.2632
temp: 298.150 k
press: 1.00000 atm
elementType: 8 7 6 6 6 6 6 6 6 6 6 6 6 6 6 6 6 6 6 6 6 6 6 1 1 1 1 1 1 1 1 1 1 1 1 1 1 1 1 1 1 1 1 1 1 1 1 1 1 1 1 1 1 1
symmnumber: 1
zpe: 1249737.2 jmol-1
zpe.correction: 0.476000 hartree
zpe.thermalcorrener: 0.497540 hartree
zpe.thermalcorrenthalpy: 0.498484 hartree
zpe.thermalcorrgfe: 0.426974 hartree
zpe.sumelectzpe: -946.949174 hartree
zpe.sumelectthermal: -946.927634 hartree
zpe.sumelectthermalent: -946.926689 hartree
zpe.sumelectthermalfe: -946.998200 hartree
dipole: 0.4132 0.2752 0.8309
dipole: 0.9679
quadrupole: -143.1330 -128.8658 -143.0509
quadrupole: 10.0710 1.3921 4.2948
quadrupole: -4.7831 9.4841 -4.7010 10.0710 1.3921 4.2948
hfenergy: -947.4251737 hartree
pointgroup: C01 [X(C21H31N1O1)]
dipole: 0.1640614 0.0871982 0.3324082 debye
polarizability: 276.9430594|12.9457137|225.8062802|-7.2890516|17.0313467|188.1665667 unknown
InChI: InChI=1S/C21H31NO/c1-15(2)8-11-22-12-10-21-9-4-3-5-18(21)20(22)13-16-6-7-17(23)14-19(16)21/h6-7,14-15,18,20,23H,3-5,8-13H2,1-2H3
charge 0 multiplicity 1
54 atoms
O  5.06986 1.796553 -0.765791
N  -2.013338 -0.397075 -0.937026
C  1.070151 -1.166736 -0.650938
C  -0.070194 -1.284054 0.381524
C  -0.850692 -0.006736 -0.095713
C  0.272865 -1.182024 -2.063717
C  2.059282 -2.355636 -0.534379
C  0.406637 -1.480621 1.83581
C  1.73224 0.230821 -0.287962
C  -0.485618 1.163984 0.826616
C  -1.317335 -1.314712 -1.97044
C  2.534778 -2.580883 0.923942
C  1.338575 -2.719361 1.901947
C  1.046482 1.253487 0.499358
C  -3.163502 -1.068436 -0.287453
C  3.066062 0.477943 -0.677138
C  1.755227 2.418265 0.861041
C  -3.90618 -0.130241 0.687474
C  3.742032 1.663409 -0.31032
C  3.09735 2.639914 0.477472
C  -4.469815 1.170123 0.05533
C  -5.543399 0.873943 -1.018162
C  -5.039395 2.094363 1.157186
H  -0.670988 -2.185811 0.148448
H  -0.279606 0.390572 -0.944637
H  0.61614 -2.05553 -2.65426
H  0.538369 -0.287425 -2.658371
H  2.927206 -2.240666 -1.21268
H  1.52083 -3.264679 -0.876009
H  -0.464956 -1.622946 2.505448
H  0.961899 -0.600826 2.209013
H  -0.673234 0.998124 1.903987
H  -0.976057 2.111824 0.532476
H  -1.741877 -1.10523 -2.971574
H  -1.555318 -2.376139 -1.732225
H  3.170228 -1.731242 1.242192
H  3.168126 -3.488329 0.970049
H  0.75983 -3.631193 1.642775
H  1.711338 -2.860358 2.93515
H  -2.852142 -1.991806 0.269663
H  -3.851816 -1.405301 -1.086903
H  3.6208 -0.255219 -1.270241
H  1.237018 3.188005 1.445906
H  -3.21679 0.143055 1.512954
H  -4.739231 -0.699806 1.151523
H  3.616143 3.560565 0.77449
H  -3.624995 1.68562 -0.443663
H  -5.126955 0.292043 -1.859855
H  -6.3866 0.300005 -0.584785
H  -5.953179 1.813802 -1.433596
H  -5.416122 3.042768 0.73008
H  -5.881693 1.605741 1.686088
H  -4.268212 2.343777 1.911172
H  5.457871 2.654716 -0.463173
