program: Gaussian 09
title: 000114118
version: EM64L-G09RevD.01
frameworkgroup: C1[X(C20H11ClINO3)]
method: RPBEPBE
basis: SDD
operation: Freq
keyword: #p
keyword: freq=noraman
keyword: PBEPBE/SDD
title: #p freq=noraman PBEPBE/SDD
converged: YES YES NO NO
title: Mulliken charges:
elementType: I Cl O O O N C C C C C C C C C C C C C C C C C C C C H H H H H H H H H H H
charge: 0.099367 -0.059483 -0.325921 -0.368461 -0.155066 -0.005182 0.453149 0.526186 0.219162 -0.577828 -0.560219 0.183200 -0.136994 0.616689 0.367745 -0.439191 -0.393085 0.133060 -0.594498 -0.395221 -0.246711 -0.227255 -0.298296 -0.147706 -0.181473 -0.370841 0.282264 0.253646 0.261543 0.264649 0.234832 0.233234 0.253979 0.252862 0.235526 0.249068 0.363273
chargesum: 0.00000
title: Mulliken charges with hydrogens summed into heavy atoms:
elementType: I Cl O O O N C C C C C C C C C C C C C C C C C C C C
charge: 0.099367 -0.059483 -0.325921 -0.005189 -0.155066 -0.005182 0.453149 0.526186 0.219162 -0.295564 -0.560219 0.183200 -0.136994 0.616689 0.367745 -0.185545 -0.131542 0.133060 -0.594498 -0.130572 -0.011879 0.005979 -0.044317 0.105156 0.054053 -0.121774
polarizability: 4.49163306e+02 3.21798859e+01 2.39645128e+02 4.95670284e+00 9.04954142e+00 1.91469005e+02
1716.lowfreq: -7.2365 -3.6604 -2.3109 -0.0015 -0.0014 -0.0007 12.5894 15.4684 22.6590
frequency: 12.0546 15.4536 22.6412 64.1868 70.0606 93.2587 103.8445 110.0727 125.0571 133.7128 146.2168 178.3170 200.7902 208.5080 240.7069 273.7513 303.1669 304.5070 313.2306 328.6859 365.2697 387.5590 422.0089 429.2258 435.9389 467.7763 471.0325 477.7536 496.7414 522.4210 540.3015 550.1047 565.5492 575.8700 597.5505 622.6363 636.6311 646.9706 653.5299 700.8696 721.2630 744.8062 767.5732 778.4594 788.5580 800.4578 801.3696 829.0708 838.8873 850.7841 876.5156 878.4478 924.3444 936.6660 946.3383 946.9075 950.3795 973.1124 993.7269 995.5012 1028.4973 1029.5437 1043.6492 1102.3396 1105.0914 1146.3995 1151.3034 1176.0528 1184.1663 1201.9771 1230.7460 1239.7774 1253.0518 1265.4615 1316.2386 1321.0146 1329.1628 1359.2514 1371.8681 1398.9893 1400.4022 1419.0558 1438.2240 1443.2662 1455.6641 1485.8449 1509.0326 1550.3030 1567.0235 1582.7786 1597.4755 1607.2810 1634.7110 1680.9168 3130.8640 3132.9533 3140.6524 3145.5684 3158.7326 3162.9226 3171.2113 3173.5410 3176.1300 3181.1587 3474.9942
redmass: 6.3319 10.1141 11.4252 8.0829 8.7478 7.0390 7.2320 7.1696 6.1774 6.1329 8.6273 5.1174 9.7782 8.4038 6.9281 7.7399 7.8000 6.1776 8.2611 6.6505 6.9271 7.8908 4.2392 6.4609 3.3718 3.2131 1.3512 5.1878 5.7260 3.8077 3.8092 6.3642 7.1425 5.5357 5.7189 6.9288 4.3333 7.2315 7.5436 6.3597 6.3394 5.1976 1.3844 6.0478 2.8287 2.1052 5.0972 1.8757 4.0397 2.2284 2.7128 2.2176 7.2499 1.6087 1.6895 3.7827 1.4366 1.4378 1.3734 1.3395 2.3694 3.4308 2.7855 2.4670 2.5058 1.4982 1.8358 1.1816 1.4576 1.6278 1.7666 2.2890 1.9616 2.2834 2.3794 5.3934 2.2775 2.8348 1.9193 3.2118 6.2913 4.9734 2.9624 2.8495 3.1248 4.3273 4.2758 7.9898 7.5210 6.0182 6.4743 7.9839 7.2271 12.7599 1.0864 1.0894 1.0894 1.0902 1.0946 1.0894 1.1002 1.0992 1.0922 1.0968 1.0645
irintensity: 0.2829 0.3035 0.3704 0.0152 1.0599 0.3292 0.8029 0.7591 0.4561 0.2838 0.6777 5.8483 0.6422 1.5718 0.7258 2.2337 7.2023 1.1065 1.6987 0.5858 1.0592 2.7890 2.0564 0.1081 5.9850 1.2763 117.4858 25.1943 18.8102 11.2809 0.3162 3.4274 23.1914 3.9896 5.8784 8.0431 5.3450 6.2439 42.4964 16.4154 13.0759 1.8005 65.4096 158.4712 27.5816 29.1268 14.8567 1.8804 41.2107 48.6155 60.9974 37.4549 21.7653 12.3526 48.7069 207.4609 8.5473 7.4864 0.4809 0.0122 17.2254 170.3955 116.6956 138.4821 175.9569 88.1792 110.2152 62.3875 271.4253 2.7883 2.7679 55.2740 37.3897 88.6504 23.1262 5.4867 48.7922 86.9808 41.6689 1.3692 55.8332 6.9042 18.7438 63.3736 19.9629 30.2217 7.8841 3.8736 9.7021 34.9221 22.7095 5.3947 70.3547 292.8030 0.3021 13.2489 8.7764 2.9953 14.0102 4.6378 26.7547 21.8325 0.2422 1.9852 62.4572
temp: 298.150 k
press: 1.00000 atm
elementType: 53 17 8 8 8 7 6 6 6 6 6 6 6 6 6 6 6 6 6 6 6 6 6 6 6 6 1 1 1 1 1 1 1 1 1 1 1
symmnumber: 1
zpe: 668906.4 jmol-1
zpe.correction: 0.254773 hartree
zpe.thermalcorrener: 0.276352 hartree
zpe.thermalcorrenthalpy: 0.277296 hartree
zpe.thermalcorrgfe: 0.200185 hartree
zpe.sumelectzpe: -1518.961633 hartree
zpe.sumelectthermal: -1518.940054 hartree
zpe.sumelectthermalent: -1518.939110 hartree
zpe.sumelectthermalfe: -1519.016221 hartree
dipole: 0.9884 3.2328 -0.3595
dipole: 3.3996
quadrupole: -146.1755 -162.5390 -161.9703
quadrupole: 3.4325 -4.2819 6.6667
quadrupole: 10.7195 -5.6441 -5.0754 3.4325 -4.2819 6.6667
hfenergy: -1519.2164057 hartree
pointgroup: C01 [X(C20H11Cl1I1N1O3)]
dipole: 0.4527268 -1.1828366 0.4298985 debye
polarizability: 447.4471774|-30.4052649|240.1771803|-25.1033419|-1.2804027|192.6530807 unknown
InChI: InChI=1S/C20H11ClINO3/c21-17-12-5-2-1-4-11(12)10-14(19(17)24)20(25)26-16-8-7-15(22)13-6-3-9-23-18(13)16/h1-10,24H
charge 0 multiplicity 1
37 atoms
I  -7.096827 0.276899 1.11338
Cl 4.986004 2.119442 -1.702067
O  -0.712226 0.715343 0.917271
O  2.031427 2.712179 -1.50784
O  -0.629598 1.778856 -1.178818
N  -1.964941 -1.062577 -0.823856
C  3.109618 -0.863124 0.518758
C  4.145668 -0.107411 -0.162864
C  1.393864 0.765618 -0.205347
C  1.761064 -0.398567 0.479056
C  3.73646 1.080939 -0.837096
C  2.41056 1.536965 -0.880954
C  -2.761982 -0.301885 0.01262
C  -4.212199 -0.420529 0.042959
C  -2.120407 0.634476 0.895211
C  3.46712 -2.064206 1.214582
C  5.495711 -0.583771 -0.116759
C  -0.039304 1.157163 -0.284638
C  -4.939447 0.387673 0.980107
C  -2.860798 1.397155 1.792535
C  4.789951 -2.507722 1.244965
C  5.807249 -1.75847 0.572883
C  -4.798416 -1.352368 -0.874682
C  -4.281833 1.269548 1.8401
C  -3.98362 -2.097932 -1.72706
C  -2.564897 -1.926845 -1.660333
H  0.976547 -0.97109 0.980895
H  2.677665 -2.62886 1.72384
H  6.279321 -0.016666 -0.628005
H  -2.34675 2.098649 2.455366
H  5.054829 -3.425795 1.77925
H  6.843632 -2.112267 0.6003
H  -5.886899 -1.468977 -0.894866
H  -4.847022 1.877425 2.5513
H  -4.411551 -2.811563 -2.437114
H  -1.904282 -2.512392 -2.309975
H  2.82501 3.147685 -1.922905
