program: Gaussian 09
title: 000114074
version: EM64L-G09RevD.01
frameworkgroup: C1[X(C10H28N4O3P2)]
method: RPBEPBE
basis: SDD
operation: Freq
keyword: #p
keyword: freq=noraman
keyword: PBEPBE/SDD
title: #p freq=noraman PBEPBE/SDD
converged: NO YES NO NO
title: Mulliken charges:
elementType: P P O O O N N N N C C C C C C C C C C H H H H H H H H H H H H H H H H H H H H H H H H H H H H
charge: 1.397366 1.403354 -0.775761 -0.622670 -0.621333 -0.481772 -0.522232 -0.486645 -0.463038 -0.287578 -0.259570 -0.591623 -0.578061 -0.579788 -0.567827 -0.579088 -0.586687 -0.672433 -0.659643 0.244037 0.248905 0.204584 0.247464 0.221145 0.255264 0.244131 0.251287 0.223629 0.228057 0.220739 0.273308 0.220437 0.223924 0.227213 0.252072 0.258247 0.243223 0.217636 0.260906 0.256348 0.213249 0.219871 0.212633 0.217167 0.223978 0.212283 0.213289
chargesum: 0.00000
title: Mulliken charges with hydrogens summed into heavy atoms:
elementType: P P O O O N N N N C C C C C C C C C C
charge: 1.397366 1.403354 -0.775761 -0.622670 -0.621333 -0.481772 -0.522232 -0.486645 -0.463038 0.205364 0.192478 0.128918 0.124912 0.134697 0.135383 0.140017 0.143816 -0.022762 -0.010093
polarizability: 2.11405135e+02 4.44655022e+00 1.98054641e+02 5.61691160e+00 -2.57965171e+00 1.71942510e+02
1716.lowfreq: -19.3501 -5.4916 -0.0013 -0.0013 -0.0012 6.8040 16.5324 31.8474 38.5495
frequency: 11.2250 31.7171 38.3791 44.0199 53.8235 61.9547 67.1278 68.7004 77.4419 95.8071 101.1665 114.9466 135.1408 145.2192 150.1160 166.5019 172.9489 178.3286 184.1170 189.6400 200.5833 211.0004 215.0806 225.6186 232.1602 270.2937 270.7999 281.5304 299.3004 318.1756 320.4089 322.7673 335.0933 358.2546 368.7227 395.6450 412.9459 422.1476 438.7917 459.9266 467.5352 555.0436 595.2529 658.7150 684.3381 693.2510 702.9071 785.5217 801.7215 902.4131 904.9395 954.5366 962.0322 995.5850 999.8365 1020.8944 1023.1129 1058.9279 1059.3285 1072.0895 1073.4840 1089.2839 1092.2007 1094.9033 1100.2917 1111.8866 1117.3335 1133.8900 1138.3084 1180.7526 1183.8705 1195.0177 1195.4125 1222.8718 1225.7008 1267.5716 1271.3972 1324.3738 1325.8638 1366.5204 1370.0003 1381.3213 1384.5786 1414.6025 1417.8128 1427.3579 1428.3008 1433.3913 1436.1077 1458.9397 1463.0806 1464.6199 1465.5687 1468.2622 1472.6005 1473.8563 1476.5770 1477.3540 1479.2085 1480.5390 1482.3370 1483.4868 1485.6356 1488.5393 1489.6093 1494.9347 1496.4356 2939.4972 2943.7708 2947.0020 2954.4663 2955.8006 2959.8434 2961.5362 2977.2226 2981.8935 2983.8049 3025.0185 3028.8521 3036.3136 3043.1212 3047.5140 3053.2346 3055.1793 3065.4097 3079.5324 3080.8984 3090.0882 3090.6736 3092.8612 3093.4800 3095.3676 3095.9190 3099.5741 3115.3281
redmass: 4.0391 3.1246 3.0142 2.8551 3.6876 3.2020 2.9020 2.3895 2.5619 2.7722 2.4277 1.9601 2.1224 2.5470 3.9940 1.3948 1.3471 1.2425 1.1222 1.4576 1.3998 1.3422 1.8716 2.0798 1.9833 2.8278 2.6923 3.3677 3.7113 2.9844 3.7728 3.0863 4.0262 3.1268 2.5523 4.4364 4.1594 4.1775 5.8065 4.3916 4.1726 5.3519 4.2973 7.8925 5.3791 5.7280 15.2958 1.1552 1.1408 2.4211 2.3348 3.1161 2.9987 2.9064 3.2093 4.4744 4.8999 1.4241 1.4040 2.1753 2.4098 1.5124 1.2140 1.2220 1.4407 1.3411 1.4092 1.3491 1.3588 4.3021 4.4538 4.6546 5.0699 1.7883 1.9078 2.1792 2.1238 1.2631 1.2359 1.2618 1.2652 1.2274 1.2367 1.1257 1.1244 1.1367 1.1394 1.1411 1.1445 1.0445 1.0456 1.0457 1.0564 1.0469 1.0488 1.0458 1.0483 1.0469 1.0603 1.0496 1.0516 1.0463 1.0487 1.0515 1.0704 1.0562 1.0524 1.0412 1.0417 1.0416 1.0681 1.0361 1.0381 1.0352 1.0645 1.0356 1.0353 1.0945 1.0957 1.0944 1.1001 1.1020 1.0985 1.0967 1.0955 1.0981 1.0964 1.1012 1.0992 1.0996 1.0981 1.0999 1.0988 1.0992 1.0963
irintensity: 1.0621 0.7507 1.4447 0.1206 6.9789 0.3659 2.2520 0.7482 0.2014 0.5093 6.1994 2.4767 1.3671 1.0837 0.1247 0.2040 1.0832 0.4069 0.1883 0.7335 0.4515 1.0729 4.1422 14.9643 3.6856 9.3873 12.7090 16.8121 28.6854 12.8272 2.5453 1.1302 11.8895 10.3382 8.5427 1.3984 9.6431 23.9987 46.1227 24.0885 19.7065 11.7536 27.2629 0.0316 47.2460 86.5682 800.8211 16.5435 13.4935 68.2911 42.5018 116.1597 143.3612 87.0821 57.9249 105.3941 189.4057 5.0076 16.7221 6.3532 5.5398 8.7667 0.2473 0.5910 9.2997 4.2558 3.3388 0.0774 0.3674 35.1120 109.3757 8.3117 54.3657 10.4564 29.0745 11.7896 8.2594 6.7651 4.4573 3.1579 1.3155 22.2762 18.6958 12.3588 10.5404 17.3256 17.0708 0.5345 2.1300 6.2256 1.3146 32.6446 5.5589 3.4079 5.5177 1.3894 32.4271 2.5933 2.6657 15.1078 33.4381 6.8701 5.2004 24.3251 23.4271 0.8754 10.1262 41.8792 174.2893 70.1868 88.0393 39.0770 54.8180 62.4087 22.0033 31.5373 35.4533 65.1524 8.2372 32.5104 50.9410 18.2121 0.5621 31.3478 7.2915 36.0185 40.3592 31.2772 15.0782 31.5943 18.3296 13.4750 25.2286 6.6994 7.1571
temp: 298.150 k
press: 1.00000 atm
elementType: 15 15 8 8 8 7 7 7 7 6 6 6 6 6 6 6 6 6 6 1 1 1 1 1 1 1 1 1 1 1 1 1 1 1 1 1 1 1 1 1 1 1 1 1 1 1 1
symmnumber: 1
zpe: 1036233.7 jmol-1
zpe.correction: 0.394681 hartree
zpe.thermalcorrener: 0.422482 hartree
zpe.thermalcorrenthalpy: 0.423426 hartree
zpe.thermalcorrgfe: 0.334872 hartree
zpe.sumelectzpe: -1523.359391 hartree
zpe.sumelectthermal: -1523.331590 hartree
zpe.sumelectthermalent: -1523.330646 hartree
zpe.sumelectthermalfe: -1523.419200 hartree
dipole: 1.1342 3.0090 -0.3810
dipole: 3.2381
quadrupole: -118.1091 -126.8996 -137.2896
quadrupole: -2.3121 5.8385 -3.5007
quadrupole: 9.3237 0.5331 -9.8569 -2.3121 5.8385 -3.5007
hfenergy: -1523.754072 hartree
pointgroup: C01 [X(C10H28N4O3P2)]
dipole: -0.4666637 1.1652657 0.2176682 debye
polarizability: 210.0552126|-5.4360335|197.3566888|8.7510328|4.482181|173.9903839 unknown
InChI: InChI=1S/C10H28N4O3P2/c1-9-13(7)18(15,11(3)4)17-19(16,12(5)6)14(8)10-2/h9-10H2,1-8H3
charge 0 multiplicity 1
47 atoms
P  1.429617 0.372042 -0.362348
P  -1.364992 -0.839251 0.144802
O  -0.281254 0.561022 0.057386
O  1.598261 -0.36649 -1.774601
O  -0.805252 -1.941785 1.163918
N  2.273827 -0.436303 0.917018
N  -2.814417 0.058709 0.47052
N  1.875415 2.040559 -0.158219
N  -1.634307 -1.495079 -1.434173
C  2.600433 -1.878485 0.728838
C  -2.789981 1.263397 1.337821
C  2.022284 -0.004559 2.31104
C  -4.105495 -0.656445 0.390448
C  0.975996 3.115635 -0.621354
C  3.315327 2.374715 -0.189992
C  -1.923208 -0.581398 -2.559746
C  -0.929177 -2.744061 -1.801304
C  4.009608 -2.221298 1.246279
C  -3.422019 2.490372 0.648983
H  1.828198 -2.491737 1.236965
H  2.535889 -2.090618 -0.353327
H  -3.325738 1.040656 2.285588
H  -1.741482 1.488074 1.592967
H  2.939127 -0.139915 2.911638
H  1.197969 -0.593055 2.762376
H  1.75567 1.065332 2.324572
H  -4.021368 -1.502481 -0.311631
H  -4.886086 0.02727 0.009515
H  -4.426694 -1.043041 1.380444
H  1.123567 4.003798 0.022199
H  -0.070246 2.786899 -0.531626
H  1.177548 3.4094 -1.673832
H  3.494345 3.250656 0.461697
H  3.668449 2.619807 -1.214247
H  3.905132 1.526826 0.196093
H  -0.987015 -0.248536 -3.052287
H  -2.475088 0.300755 -2.194124
H  -2.554224 -1.109626 -3.298651
H  -0.7260 -3.328037 -0.888687
H  0.029006 -2.524479 -2.312967
H  -1.579454 -3.337936 -2.47036
H  4.775146 -1.619903 0.724723
H  4.107809 -2.044868 2.332801
H  4.222452 -3.290854 1.063377
H  -2.864995 2.741035 -0.270887
H  -4.477711 2.310827 0.376272
H  -3.394071 3.364753 1.326086
