program: Gaussian 09
title: 000114064
version: EM64L-G09RevD.01
frameworkgroup: C1[X(C18H25NO3)]
method: RPBEPBE
basis: SDD
operation: Freq
keyword: #p
keyword: freq=noraman
keyword: PBEPBE/SDD
title: #p freq=noraman PBEPBE/SDD
converged: YES YES NO NO
title: Mulliken charges:
elementType: O O O N C C C C C C C C C C C C C C C C C C H H H H H H H H H H H H H H H H H H H H H H H H H
charge: -0.461281 -0.473967 -0.344571 -0.084426 0.280293 -0.164982 -0.164738 -0.474265 -0.554710 -0.105793 0.153827 -0.553746 -0.432632 -0.372942 -0.504853 0.417013 -0.024069 -0.648835 -0.442472 0.195361 -0.381474 -0.519919 0.218214 0.195272 0.204539 0.235000 0.288336 0.178372 0.177052 0.253967 0.203911 0.221297 0.169205 0.223643 0.187801 0.199407 0.202704 0.186613 0.222910 0.223005 0.338489 0.230278 0.235238 0.381591 0.238178 0.223947 0.224215
chargesum: 0.00000
title: Mulliken charges with hydrogens summed into heavy atoms:
elementType: O O O N C C C C C C C C C C C C C C C C C C
charge: -0.122793 -0.092376 -0.344571 -0.084426 0.280293 0.053232 0.030534 -0.034726 -0.088002 0.071259 0.153827 -0.095868 -0.042130 0.038502 -0.102742 0.417013 -0.024069 -0.016307 -0.212194 0.195361 -0.146237 0.166421
polarizability: 2.43107715e+02 -1.88250381e+00 1.87694960e+02 -1.63268257e+00 -1.66822697e+01 1.80171058e+02
1716.lowfreq: -1.6663 -0.0008 -0.0006 -0.0004 6.2807 10.8164 29.3983 51.4753 73.0789
frequency: 29.0898 51.4355 73.0700 82.7522 97.6574 134.6189 153.0956 173.5486 193.3381 215.0501 219.3377 221.8020 231.9734 239.9362 266.9802 289.4576 291.4158 308.0563 322.7508 342.3410 351.9454 360.5229 380.2923 411.8476 432.7543 457.3339 470.2404 495.6187 501.9536 525.4766 534.6855 542.9991 561.6262 584.3461 614.2080 630.0322 684.8305 688.3309 722.0681 744.6654 764.9952 778.8916 799.1909 830.5302 835.2549 865.7996 873.1095 900.7526 907.7624 909.9048 938.6746 964.0352 986.2784 994.0689 1005.0831 1026.9486 1037.0288 1049.0113 1063.2739 1077.0636 1084.6897 1103.0855 1110.9158 1118.1643 1118.5598 1122.2591 1142.1830 1149.1776 1150.5772 1169.3651 1178.6818 1181.0297 1198.9288 1217.6232 1222.6022 1235.7397 1242.3810 1256.3039 1261.1398 1265.2306 1274.3905 1292.3925 1304.7645 1324.6406 1331.7023 1338.2160 1342.0626 1346.4668 1352.0700 1357.8939 1362.3231 1372.6215 1387.3831 1394.2798 1431.2821 1435.2879 1437.0411 1451.0056 1458.4411 1460.0325 1463.1170 1464.4101 1466.3674 1474.3330 1476.6973 1478.9745 1480.7901 1499.9876 1587.9279 1620.4819 2805.6841 2836.6491 2888.6115 2910.1536 2951.1764 2954.6404 2959.6482 2961.5615 2988.3436 2989.7560 2990.1081 3005.1915 3006.7001 3012.2058 3046.8264 3048.4711 3048.6977 3063.6252 3065.7809 3101.4010 3120.0175 3121.8238 3157.9492 3462.6743 3550.9052
redmass: 4.0531 3.6086 3.8408 4.0102 3.9363 4.4917 3.4136 2.7284 2.6415 1.1773 1.2477 1.3104 2.5666 2.5444 3.6802 2.6007 3.6009 3.3610 3.3892 3.9161 2.8289 3.3495 3.5498 3.5798 2.4859 3.4575 3.6239 2.7726 3.6683 1.1179 3.8850 2.9698 3.7391 3.1618 4.6386 4.9171 4.4122 3.9066 2.9510 6.0963 3.3809 1.4347 3.4689 2.0286 3.3285 2.8173 2.1361 1.6052 1.9513 2.3571 2.8180 2.2646 2.4181 2.7157 2.5208 2.4574 3.2301 2.2134 2.0551 1.9209 2.1155 1.7953 1.6706 1.8318 1.2585 2.2356 1.3967 1.3759 1.9421 1.3842 2.1043 1.6630 1.4959 1.3029 1.6680 1.9169 1.3305 2.2572 1.3743 2.3945 1.4595 1.3349 1.7589 1.3994 1.6773 1.4615 1.3585 1.4411 1.4351 1.4396 1.6161 1.5791 1.5836 2.8255 1.5913 1.1211 1.1772 1.5599 1.0926 1.1385 1.0500 1.1639 1.0545 1.0942 2.6056 1.0608 1.1498 1.0807 7.5869 6.9190 1.0715 1.0589 1.0833 1.0824 1.0733 1.0676 1.0740 1.0334 1.0628 1.0633 1.0645 1.0723 1.0815 1.0972 1.1021 1.0975 1.1039 1.1004 1.0997 1.0904 1.0914 1.0969 1.0948 1.0640 1.0659
irintensity: 0.5287 4.7238 0.6556 1.2012 1.6640 1.3554 4.2429 1.4029 3.2389 115.5204 0.4017 0.8417 2.2940 4.8315 1.5985 1.5842 3.3265 2.6497 1.9735 3.9710 7.7936 2.6532 0.2381 6.4767 4.1369 5.0055 6.1049 0.8450 1.3394 107.8933 5.8768 5.0603 0.8163 6.5799 0.2061 5.3296 12.7402 6.3599 3.3689 1.2012 4.7721 41.1512 16.5564 3.1060 20.9840 0.9155 10.1353 7.2844 14.4926 14.1051 11.8347 25.5295 1.3244 15.5770 6.9449 17.9871 65.3191 64.5794 42.7590 0.5821 7.3037 9.7469 8.0018 3.7671 0.1760 18.4416 5.3081 22.4702 26.0447 0.2792 26.5600 15.5826 4.2502 9.0377 43.1787 51.1074 11.1972 110.7242 72.4168 24.7587 4.5959 23.1239 6.3230 4.9295 3.0197 1.2159 1.0983 1.2196 9.2665 6.9509 8.4623 11.3984 7.5123 10.1820 56.5365 31.6721 4.9240 38.8846 9.2711 30.2067 14.1805 15.7046 14.6145 36.4223 36.0868 7.3830 12.3757 5.7152 8.4648 5.4191 91.6757 202.9110 85.5114 73.7846 7.3742 37.3911 170.6591 48.9461 55.3907 37.9792 13.2724 37.7568 80.3516 42.1802 57.4983 3.8803 51.4133 36.5371 35.0263 3.9892 32.3631 6.1549 19.5684 86.6372 4.8908
temp: 298.150 k
press: 1.00000 atm
elementType: 8 8 8 7 6 6 6 6 6 6 6 6 6 6 6 6 6 6 6 6 6 6 1 1 1 1 1 1 1 1 1 1 1 1 1 1 1 1 1 1 1 1 1 1 1 1 1
symmnumber: 1
zpe: 1048441.7 jmol-1
zpe.correction: 0.399330 hartree
zpe.thermalcorrener: 0.419636 hartree
zpe.thermalcorrenthalpy: 0.420581 hartree
zpe.thermalcorrgfe: 0.352159 hartree
zpe.sumelectzpe: -979.617806 hartree
zpe.sumelectthermal: -979.597500 hartree
zpe.sumelectthermalent: -979.596556 hartree
zpe.sumelectthermalfe: -979.664977 hartree
dipole: -0.5970 0.6306 0.8956
dipole: 1.2475
quadrupole: -104.9830 -126.7614 -129.9265
quadrupole: 5.2277 -1.3628 2.1617
quadrupole: 15.5740 -6.2045 -9.3695 5.2277 -1.3628 2.1617
hfenergy: -980.0171366 hartree
pointgroup: C01 [X(C18H25N1O3)]
dipole: 0.2877751 -0.1654976 0.3615054 debye
polarizability: 242.4149325|4.7601379|192.865431|-5.9092293|14.4221114|175.6933696 unknown
InChI: InChI=1S/C18H25NO3/c1-19-9-8-18-7-3-4-13(20)16(18)12(19)10-11-5-6-14(22-2)17(21)15(11)18/h5-6,12-13,16,20-21H,3-4,7-10H2,1-2H3
charge 0 multiplicity 1
47 atoms
O  -0.915796 -1.219113 2.646025
O  1.967291 -1.274163 -1.624181
O  4.028405 0.090318 -0.832066
N  -2.546187 1.387773 -0.592239
C  -0.811877 -0.937098 -0.589031
C  -2.001449 -0.832182 0.419488
C  -2.293765 0.660965 0.698408
C  -1.294456 -0.272243 -1.950725
C  -0.536838 -2.454624 -0.842455
C  -1.927132 -1.722599 1.687937
C  0.406952 -0.126402 -0.081721
C  -1.111536 1.321778 1.435416
C  -2.598065 0.545716 -1.80103
C  -0.332196 -3.267944 0.451482
C  -1.604561 -3.188389 1.321531
C  0.243357 0.954278 0.84421
C  1.707573 -0.32232 -0.613896
C  -3.622629 2.382612 -0.499886
C  1.354694 1.730507 1.242622
C  2.816788 0.459559 -0.187342
C  2.656241 1.488829 0.751683
C  5.229052 0.845298 -0.486028
H  -2.883878 -1.249794 -0.111861
H  -3.200672 0.727392 1.345699
H  -1.453191 -1.059274 -2.713225
H  -0.49766 0.391468 -2.326859
H  0.323205 -2.570608 -1.517023
H  -1.429529 -2.860251 -1.366151
H  -2.92429 -1.67451 2.18419
H  -1.127708 1.02211 2.49846
H  -1.240269 2.420594 1.386672
H  -2.707903 1.214328 -2.677071
H  -3.491025 -0.135649 -1.819739
H  0.536411 -2.871596 1.011705
H  -0.10729 -4.322612 0.201582
H  -2.458923 -3.620735 0.761552
H  -1.5003 -3.787097 2.251476
H  -4.642841 1.933657 -0.376631
H  -3.636256 3.009586 -1.41083
H  -3.445134 3.049648 0.363759
H  -0.731596 -1.940475 3.29982
H  1.196679 2.549289 1.954502
H  3.499865 2.102047 1.082725
H  2.937992 -1.208355 -1.840005
H  6.039639 0.40573 -1.086267
H  5.463543 0.744554 0.591381
H  5.111566 1.916495 -0.740862
