program: Gaussian 09
title: 000014284
version: EM64L-G09RevD.01
frameworkgroup: C1[X(C7H10N2)]
method: RPBEPBE
basis: SDD
operation: Freq
keyword: #pfreq=noraman
keyword: PBEPBE/SDD
title: #p freq=noraman PBEPBE/SDD
converged: YES YES NO NO
title: Mulliken charges:
elementType: N N C C C C C C C H H H H H H H H H H
charge: -0.151947 -0.028164 0.449277 -0.645040 -0.645030 -0.298347 -0.298348 -0.347607 -0.347599 0.218099 0.237948 0.238292 0.238315 0.218100 0.237921 0.231548 0.231544 0.230518 0.230520
chargesum: 0.00000
title: Mulliken charges with hydrogens summed into heavy atoms:
elementType: N N C C C C C C C
charge: -0.151947 -0.028164 0.449277 0.049300 0.049306 -0.066799 -0.066805 -0.117088 -0.117079
polarizability: 1.22101625e+02 -1.21154911e-05 9.29696645e+01 1.42333348e-03 -8.25120479e-02 4.70059322e+01
1716.lowfreq: -18.3583 -7.4785 -0.0008 -0.0007 -0.0007 11.6645 85.9686 97.9202 136.9056
frequency: 85.7049 97.8641 136.9051 186.1719 234.6079 279.1360 369.6452 390.1647 467.0633 530.7175 532.5177 659.5201 735.2788 735.7919 807.4396 830.7255 939.1881 942.0271 958.5561 959.4424 1050.5447 1055.9793 1095.2974 1108.7488 1111.6904 1168.0427 1229.2165 1252.9249 1325.9535 1342.8492 1369.8411 1419.9193 1436.0772 1454.1828 1465.5238 1476.8294 1488.6206 1489.1880 1512.1460 1534.0844 1602.8545 2945.2707 2952.9479 3012.8668 3015.5848 3098.1312 3108.0296 3120.3424 3123.5693 3167.9142 3170.8435
redmass: 2.2554 1.8087 1.8692 1.1317 3.1997 2.9299 3.4754 2.6063 3.6625 3.6422 2.6706 6.9926 5.0440 3.0331 1.7502 1.2450 1.3428 3.5703 5.3331 1.4599 2.1810 1.4839 1.6988 1.2383 1.3229 1.6797 1.2521 2.8386 6.1304 1.3986 2.6378 2.2466 1.2176 1.2705 1.0392 1.0451 1.6513 1.0938 1.3136 6.2029 5.4674 1.0367 1.0393 1.0995 1.1032 1.0966 1.0945 1.0878 1.0911 1.0932 1.0950
irintensity: 0.0000 3.4827 0.0364 0.0007 0.1742 9.8928 1.3335 0.0000 1.9437 0.5058 17.7779 0.5008 4.2547 0.5351 87.7435 0.0000 0.0376 4.5567 38.5756 0.1042 0.0197 24.2066 1.3807 0.0110 1.1083 1.4759 21.2457 33.6556 10.3272 8.1226 43.7582 0.0061 4.1340 26.3550 0.0039 22.0948 3.5300 3.8872 112.1914 26.1489 344.7620 99.5614 55.3375 0.0034 84.5806 4.8131 40.9775 34.7972 14.5243 33.9212 2.6330
temp: 298.150 k
press: 1.00000 atm
elementType: 7 7 6 6 6 6 6 6 6 1 1 1 1 1 1 1 1 1 1
symmnumber: 1
zpe: 416207.6 jmol-1
zpe.correction: 0.158525 hartree
zpe.thermalcorrener: 0.167290 hartree
zpe.thermalcorrenthalpy: 0.168234 hartree
zpe.thermalcorrgfe: 0.124865 hartree
zpe.sumelectzpe: -381.553015 hartree
zpe.sumelectthermal: -381.544250 hartree
zpe.sumelectthermalent: -381.543306 hartree
zpe.sumelectthermalfe: -381.586675 hartree
dipole: -5.5448 0.0000 0.0009
dipole: 5.5448
quadrupole: -58.5519 -46.2665 -57.7077
quadrupole: -0.0001 -0.0026 -0.0052
quadrupole: -4.3765 7.9088 -3.5323 -0.0001 -0.0026 -0.0052
hfenergy: -381.7115405 hartree
pointgroup: C01 [X(C7H10N2)]
dipole: -2.181487 -0.0003784 0.0000305 debye
dipolederiv: -1.5311657 -0.0001584 0.000213 -0.0001055 -0.5209073 0.0127109 0.0015823 0.0081384 -0.3014258 -0.6002643 0.000005 0.0000646 0.0000066 -0.6473477 0.0190417 0.0001146 0.0192078 -0.2592908 1.6264852 0.0002671 -0.0004506 0.000251 0.0112961 0.0058062 -0.0007625 0.006994 0.163642 0.2705809 0.1613428 -0.0080341 0.3607988 0.455435 -0.0115459 -0.0172171 -0.0115182 0.2544475 0.2707981 -0.1614412 0.0081676 -0.3609077 0.4551885 -0.0120274 0.0168462 -0.012059 0.2545089 -0.5709498 0.0265618 -0.001585 0.3657861 -0.0691645 -0.0077586 -0.0173194 -0.0081789 -0.2184606 -0.5707989 -0.0267294 0.0017114 -0.3659353 -0.0692792 -0.0076376 0.0175062 -0.0080726 -0.2184718 0.4654389 0.0224898 -0.0010786 0.0292455 0.4120621 -0.0246405 -0.0017368 -0.0245399 -0.0862776 0.4654442 -0.0224822 0.0007732 -0.029245 0.4120387 -0.0246239 0.0013711 -0.0245522 -0.0862793 -0.1588804 0.0053801 -0.0025055 0.0973446 0.0898067 0.0026714 -0.0064302 0.0023734 0.1172038 0.0844438 0.0451888 -0.0681886 -0.1016191 -0.0636027 0.0913158 0.0159037 0.1255834 -0.0980529 0.0847893 0.0552197 0.0667215 -0.0989509 -0.0834665 -0.0921261 -0.0030687 -0.1245152 -0.0744496 0.0849223 -0.0554226 -0.0667607 0.0986417 -0.0835757 -0.0922043 0.0027371 -0.1243087 -0.0740077 -0.1588307 -0.005461 0.0027916 -0.0974255 0.0897817 0.0028977 0.006702 0.0025423 0.1171775 0.0842546 -0.0448491 0.068037 0.1020238 -0.0634445 0.0912351 -0.016385 0.1257354 -0.0985045 0.0410525 -0.1045359 0.0054497 -0.0808396 -0.0600458 0.0117668 0.0045262 0.0120445 0.171785 0.0409822 0.1045771 -0.0053763 0.0808781 -0.0599917 0.0117463 -0.0044403 0.0119546 0.1717922 0.0358164 0.0984336 -0.0048269 0.0933658 -0.1023648 0.0116582 -0.0048124 0.0115502 0.1323341 0.0358814 -0.098386 0.0048769 -0.0933134 -0.1024185 0.0117145 0.004883 0.0116206 0.1323296 unknown
polarizability: 122.101621|0.0044667|92.8574808|-0.0146706|-2.2695035|47.1181196 unknown
InChI: InChI=1S/C7H10N2/c1-9(2)7-3-5-8-6-4-7/h3-6H,1-2H3
charge 0 multiplicity 1
19 atoms
N  -1.729908 0.00016 0.001919
N  2.557421 0.000834 0.000474
C  -0.338196 0.000394 0.001378
C  -2.464853 -1.271193 0.058011
C  -2.465381 1.271153 -0.055352
C  0.419009 -1.214417 0.061407
C  0.418605 1.215437 -0.059182
C  1.825025 -1.154656 0.057792
C  1.82464 1.156106 -0.056411
H  -3.547263 -1.069569 0.038163
H  -2.240018 -1.835882 0.985438
H  -2.223561 -1.92283 -0.805876
H  -2.223591 1.923962 0.807484
H  -3.547696 1.069149 -0.034219
H  -2.241569 1.834765 -0.983707
H  -0.070696 -2.190343 0.111277
H  -0.071428 2.19121 -0.108791
H  2.407975 -2.082732 0.103649
H  2.407286 2.084353 -0.102655
