program: Gaussian 09
title: 000111445
version: EM64L-G09RevD.01
frameworkgroup: C1[X(C13H26N2)]
method: RPBEPBE
basis: SDD
operation: Freq
keyword: #pfreq=noraman
keyword: PBEPBE/SDD
title: #p freq=noraman PBEPBE/SDD
converged: YES YES NO NO
title: Mulliken charges:
elementType: N N C C C C C C C C C C C C C H H H H H H H H H H H H H H H H H H H H H H H H H H
charge: -0.086171 -0.086166 -0.017468 -0.017475 -0.303687 -0.403081 -0.403080 -0.355471 -0.355468 -0.422646 -0.422644 -0.412267 -0.412268 -0.743337 -0.743335 0.212026 0.212027 0.183755 0.183754 0.207939 0.161536 0.207940 0.161536 0.163565 0.242062 0.163562 0.242063 0.208764 0.183742 0.208763 0.183741 0.189533 0.204622 0.189532 0.204622 0.211204 0.216337 0.207198 0.207198 0.211204 0.216338
chargesum: 0.00000
title: Mulliken charges with hydrogens summed into heavy atoms:
elementType: N N C C C C C C C C C C C C C
charge: -0.086171 -0.086166 0.194558 0.194551 0.063822 -0.033605 -0.033604 0.050156 0.050157 -0.030140 -0.030139 -0.018112 -0.018113 -0.108598 -0.108595
polarizability: 1.86945437e+02 2.66374971e-04 1.36840564e+02 3.42623360e+00 3.00628129e-05 1.33447372e+02
1716.lowfreq: -30.5812 -10.4615 -6.5822 -0.0005 -0.0005 -0.0001 30.9994 35.1102 42.1512
frequency: 28.7459 35.1083 41.7487 127.5334 151.8500 160.3773 165.3422 204.0136 209.8164 212.3208 232.3702 267.7170 284.6067 327.8425 344.8486 354.2250 372.5204 413.2332 416.0519 423.6606 428.3684 454.3900 489.2932 562.4853 622.0646 762.3886 767.3314 808.5248 830.5070 849.6977 852.4764 885.2379 888.6382 892.1445 904.4042 955.6783 968.1106 969.1027 970.2256 987.2676 993.3838 1019.8629 1051.2541 1058.9076 1084.6018 1086.1329 1108.5722 1115.7108 1129.1163 1129.6751 1151.4636 1152.2069 1160.7752 1164.9718 1187.6119 1200.4011 1217.0680 1239.4126 1259.7899 1262.6645 1280.5309 1280.9044 1287.0174 1290.7622 1300.4633 1309.2335 1315.0647 1334.9089 1336.6085 1337.7363 1339.4723 1351.3433 1354.6373 1358.8752 1368.9930 1385.0581 1386.9161 1406.2470 1453.8246 1454.9707 1455.9271 1458.0732 1459.7263 1461.3748 1472.8007 1474.2465 1475.7636 1477.4985 1477.7128 1478.8127 1480.0336 2805.2561 2806.9162 2816.8971 2819.7941 2836.0641 2868.4746 2952.1059 2952.2075 2966.3779 2966.5356 2978.1217 2978.2336 2983.5814 2983.8585 3006.7656 3006.8568 3023.7366 3023.9379 3045.7166 3045.8341 3054.0310 3055.2022 3060.3904 3060.4538 3066.4183 3066.4991
redmass: 3.4719 3.2329 3.1449 2.4427 2.3889 2.5853 2.4997 1.8393 1.0511 1.4455 2.1599 2.0437 1.9438 2.7387 2.3699 2.0702 2.4644 1.8019 2.3148 2.3866 3.1537 3.2363 2.3660 2.2762 2.9451 2.3404 2.5894 2.8233 2.2046 1.4419 1.5380 1.6791 1.4441 1.8406 2.2368 1.8032 1.6869 1.6674 1.5189 1.6057 1.6041 1.8889 2.0147 2.1604 1.8849 1.7457 2.1901 2.5022 1.7137 2.0958 1.5107 1.5062 2.2576 2.4686 1.8676 2.2466 1.3852 1.6253 1.2096 1.2257 1.3634 1.3839 1.4569 1.3748 1.3524 1.2873 1.4261 1.4270 1.4613 1.4478 1.4147 1.5284 1.4738 1.5218 1.5421 1.2224 1.2264 1.3612 1.0867 1.0897 1.0893 1.1006 1.0872 1.0825 1.0797 1.0795 1.0597 1.0547 1.0585 1.0705 1.0780 1.0678 1.0703 1.0662 1.0705 1.0588 1.1022 1.0629 1.0629 1.0361 1.0362 1.0808 1.0808 1.0622 1.0622 1.0882 1.0882 1.0974 1.0973 1.1016 1.1019 1.0887 1.0893 1.0989 1.0989 1.0990 1.0990
irintensity: 0.1955 0.0022 0.0923 1.5617 0.2655 0.1478 3.1785 0.0006 0.4418 0.0380 1.3045 0.1336 3.9418 0.0887 3.2270 4.4492 1.9347 1.2857 2.1534 0.0035 2.6287 0.6031 0.4797 0.0957 0.2524 5.1176 2.7568 1.6866 4.4033 4.3781 14.0321 7.1176 4.2245 0.5821 1.6639 0.0166 28.9942 3.9171 0.6077 10.3723 0.1069 4.3860 9.8597 79.6324 0.0164 31.2053 2.9749 59.0584 7.0304 12.9835 9.5585 9.4080 0.0009 73.8266 11.5557 12.4968 1.3090 10.1642 4.8593 12.3550 4.0437 2.4227 6.5974 9.6992 6.3429 12.2392 0.1644 1.1948 1.0537 6.3599 0.4612 18.9317 9.8168 0.2830 1.7464 35.7254 7.3488 16.3055 4.8576 2.8439 17.7326 7.8924 0.0088 1.7834 0.0052 0.0398 1.0928 26.6523 0.3265 13.5554 16.2183 38.7625 52.6048 0.3614 204.4200 220.4302 96.7923 63.5341 0.3360 73.7917 24.1645 29.1435 36.0150 14.3616 37.4352 30.4113 71.2636 32.2549 62.3817 1.0742 98.9514 13.4611 22.9717 13.0865 132.9605 29.3786 63.2861
temp: 298.150 k
press: 1.00000 atm
elementType: 7 7 6 6 6 6 6 6 6 6 6 6 6 6 6 1 1 1 1 1 1 1 1 1 1 1 1 1 1 1 1 1 1 1 1 1 1 1 1 1 1
symmnumber: 1
zpe: 979332.8 jmol-1
zpe.correction: 0.373008 hartree
zpe.thermalcorrener: 0.389070 hartree
zpe.thermalcorrenthalpy: 0.390015 hartree
zpe.thermalcorrgfe: 0.329360 hartree
zpe.sumelectzpe: -619.232429 hartree
zpe.sumelectthermal: -619.216366 hartree
zpe.sumelectthermalent: -619.215422 hartree
zpe.sumelectthermalfe: -619.276076 hartree
dipole: 0.0000 0.6368 0.0000
dipole: 0.6368
quadrupole: -93.6336 -94.4234 -94.6709
quadrupole: 0.0000 -0.5415 0.0001
quadrupole: 0.6090 -0.1808 -0.4283 0.0000 -0.5415 0.0001
hfenergy: -619.6054367 hartree
pointgroup: C01 [X(C13H26N2)]
dipole: -0.000006 0.2505311 -0.0000221 debye
polarizability: 186.9763091|0.0029652|136.8405638|3.1759246|-0.0003631|133.4164995 unknown
InChI: InChI=1S/C13H26N2/c1-12-5-3-7-14(9-12)11-15-8-4-6-13(2)10-15/h12-13H,3-11H2,1-2H3
charge 0 multiplicity 1
41 atoms
N  1.215949 0.27751 -0.024742
N  -1.215957 0.277353 0.024812
C  3.64793 0.059685 0.518858
C  -3.647949 0.059145 -0.518615
C  -0.000057 1.111062 -0.000079
C  2.4443 1.016133 0.343095
C  -2.444403 1.015753 -0.34316
C  1.373504 -0.47743 -1.290912
C  -1.373379 -0.477281 1.291181
C  3.840385 -0.776425 -0.771521
C  -3.84025 -0.776674 0.771975
C  2.529442 -1.489183 -1.175936
C  -2.529211 -1.48919 1.176509
C  4.924605 0.84199 0.890297
C  -4.924721 0.841243 -0.890162
H  3.392464 -0.636259 1.344366
H  -3.39247 -0.636972 -1.343974
H  -0.079725 1.776499 -0.898052
H  0.079519 1.776749 0.897716
H  2.258064 1.560434 1.289565
H  2.714663 1.782997 -0.433562
H  -2.258269 1.559819 -1.289785
H  -2.714801 1.782799 0.433305
H  1.580883 0.221487 -2.146059
H  0.414371 -0.983008 -1.496515
H  -1.580802 0.221832 2.146158
H  -0.414182 -0.982698 1.496876
H  4.656906 -1.511122 -0.629088
H  4.157726 -0.09707 -1.591868
H  -4.656696 -1.511496 0.629757
H  -4.157631 -0.097157 1.592172
H  2.656722 -2.016256 -2.141477
H  2.265923 -2.247123 -0.412904
H  -2.656393 -2.016035 2.142188
H  -2.265641 -2.247294 0.413658
H  4.792433 1.41342 1.828597
H  5.782237 0.157719 1.029373
H  5.193894 1.559902 0.091312
H  -5.194044 1.559296 -0.091315
H  -4.792648 1.41249 -1.828587
H  -5.782291 0.156858 -1.029056
