program: Gaussian 09
title: 000104652
version: EM64L-G09RevD.01
frameworkgroup: C1[X(C6H4Cl3N)]
method: RPBEPBE
basis: SDD
operation: Freq
keyword: #p
keyword: freq=noraman
keyword: PBEPBE/SDD
title: #p freq=noraman PBEPBE/SDD
converged: YES YES NO NO
title: Mulliken charges:
elementType: Cl Cl Cl N C C C C C C H H H H
charge: 0.008328 -0.033762 0.028077 0.077624 0.646750 -0.150649 -0.227811 -0.756616 -0.287983 -0.347901 0.259243 0.246590 0.259082 0.279029
chargesum: 0.00000
title: Mulliken charges with hydrogens summed into heavy atoms:
elementType: Cl Cl Cl N C C C C C C
charge: 0.008328 -0.033762 0.028077 0.077624 0.646750 -0.150649 -0.227811 0.008299 -0.287983 -0.068872
polarizability: 1.48903462e+02 -3.71980677e+00 1.06805979e+02 3.97711208e-03 7.59462263e-03 4.15039770e+01
1716.lowfreq: -6.3462 -0.0036 -0.0018 0.0026 7.5923 7.6893 80.0140 97.1648 105.8175
frequency: 80.0125 97.1348 105.8016 194.3516 207.0124 242.7107 288.6603 314.3692 317.3247 368.4760 467.1560 527.7045 544.0419 554.2598 565.5780 730.7082 754.3632 849.7082 896.8882 1016.1666 1040.9388 1041.4609 1167.3383 1228.8181 1317.8929 1325.7537 1394.5919 1407.1712 1454.5105 1465.9576 1518.4509 1541.5164 2998.5527 3076.5839 3128.7071 3172.0700
redmass: 9.8058 1.9903 1.5460 31.8234 17.2312 4.4942 3.5402 27.8414 8.3919 10.8994 7.3270 4.8562 8.7795 5.8559 5.9332 5.6817 7.1106 7.2566 1.4268 1.5877 1.5147 7.8237 5.2783 2.3079 7.4493 8.5460 1.7467 1.3930 1.2265 1.0438 5.5881 6.8256 1.0383 1.0971 1.0985 1.0936
irintensity: 0.0050 0.0290 1.6869 0.2294 0.5489 1.5007 2.6317 0.6140 0.9638 7.3972 11.2438 4.0039 24.4364 17.2613 0.0001 2.4539 17.4094 45.3690 13.2298 59.1093 5.8646 48.9207 83.8324 27.2039 39.6021 66.5937 71.6629 27.6133 30.6270 17.8633 13.0924 8.5324 3.6019 6.5941 5.2171 3.3004
temp: 298.150 k
press: 1.00000 atm
elementType: 17 17 17 7 6 6 6 6 6 6 1 1 1 1
symmnumber: 1
zpe: 223718.1 jmol-1
zpe.correction: 0.085210 hartree
zpe.thermalcorrener: 0.094988 hartree
zpe.thermalcorrenthalpy: 0.095932 hartree
zpe.thermalcorrgfe: 0.048751 hartree
zpe.sumelectzpe: -1665.237469 hartree
zpe.sumelectthermal: -1665.227691 hartree
zpe.sumelectthermalent: -1665.226747 hartree
zpe.sumelectthermalfe: -1665.273929 hartree
dipole: 2.2102 1.9678 0.0020
dipole: 2.9593
quadrupole: -82.4349 -77.3510 -78.7050
quadrupole: -1.5464 0.0024 0.0032
quadrupole: -2.9379 2.1459 0.7920 -1.5464 0.0024 0.0032
hfenergy: -1665.3226791 hartree
pointgroup: C01 [X(C6H4Cl3N1)]
dipole: -0.9516789 -0.6705756 0.0130591 debye
dipolederiv: -0.2437411 0.2966075 0.0091041 0.3302377 -0.6196338 -0.0156038 0.0094842 -0.0148423 -0.021026 -0.8760117 0.0616065 0.0194475 0.0298696 -0.109907 -0.0015684 0.0190074 -0.0023227 -0.0432193 -0.9004114 -0.0420514 0.0185264 -0.0554444 -0.0612314 0.0010309 0.0182058 0.0007195 -0.0463108 -0.6108934 -0.1447556 0.0081892 0.3097043 -0.4813144 -0.0112277 0.014378 -0.0012457 -0.1570441 -0.130571 0.3092375 0.0082447 0.1980732 0.1779865 -0.0032566 0.0063849 -0.0062429 0.0595027 -0.0444784 -0.5945931 -0.0079524 -0.6238451 0.775389 0.0251018 -0.0083422 0.0245045 -0.0387386 1.1812467 -0.1701037 -0.029669 -0.0444824 -0.1007675 0.0002254 -0.0278791 0.0031297 -0.0396403 0.0178497 -0.0277197 0.0000774 -0.1182347 -0.2238794 -0.0003313 -0.0002987 -0.0013899 0.0302349 1.4954413 0.2163786 -0.0299855 -0.004479 0.1024464 0.0010529 -0.0328207 -0.0037084 0.0229009 -0.0179585 0.0678663 0.0007043 -0.1302527 0.2946008 0.0072074 -0.0019785 0.0028809 -0.0260629 0.078452 0.0034173 -0.0730322 -0.0073793 0.050085 0.0643485 -0.0326136 0.0780456 0.0001079 -0.0639558 -0.0312461 0.0027571 0.0598863 0.1152068 -0.0010377 0.0040699 0.000483 0.1205311 0.0823657 -0.0004717 0.0703034 -0.0102382 0.0534185 -0.0628455 0.0289739 -0.0771301 -0.0063789 0.0326658 0.0558275 0.0032849 0.0665848 0.0276005 -0.0030959 0.0034289 -0.0028811 0.1451433 unknown
polarizability: 147.4659676|-8.3423593|108.1727223|-2.4962473|1.0845263|41.5747278 unknown
InChI: InChI=1S/C6H4Cl3N/c1-3-4(7)2-10-6(9)5(3)8/h2H,1H3
charge 0 multiplicity 1
14 atoms
Cl 1.6309 -2.22499 -0.071463
Cl -3.213777 0.599093 0.07576
Cl 3.153135 0.667733 -0.065804
N  0.678423 1.737369 0.003948
C  -0.733036 -0.748157 0.001927
C  0.687658 -0.680562 -0.029283
C  -1.397217 0.507841 0.033901
C  -1.454227 -2.073724 0.000777
C  1.342403 0.573597 -0.026872
C  -0.680806 1.720744 0.034288
H  -1.15513 -2.678057 0.876015
H  -2.544773 -1.93453 0.02204
H  -1.186853 -2.659576 -0.896932
H  -1.191902 2.68682 0.058998
