program: Gaussian 09
title: 000144947
version: EM64L-G09RevD.01
frameworkgroup: C1[X(C8H4N2S)]
method: RPBEPBE
basis: SDD
operation: Freq
keyword: #pfreq=noraman
keyword: PBEPBE/SDD
title: #p freq=noraman PBEPBE/SDD
converged: NO YES NO NO
title: Mulliken charges:
elementType: S N N C C C C C C C C H H H H
charge: 0.175077 0.318273 -0.006150 0.319739 0.259370 -0.358730 -0.334807 -0.189878 -0.229877 -0.233370 -0.739113 0.263854 0.265208 0.245032 0.245371
chargesum: 0.00000
title: Mulliken charges with hydrogens summed into heavy atoms:
elementType: S N N C C C C C C C C
charge: 0.175077 0.318273 -0.006150 0.319739 0.259370 -0.094875 -0.069598 0.055154 0.015494 -0.233370 -0.739113
polarizability: 2.15586652e+02 -8.37247733e+00 1.18107086e+02 9.17539587e-03 1.08847274e-02 4.13784732e+01
1716.lowfreq: -5.8011 -0.0013 0.0020 0.0023 1.7456 7.8268 24.9002 66.8434 133.3742
frequency: 24.8234 66.8419 133.3739 141.6895 248.8900 336.0627 357.2637 384.5387 412.1305 422.6727 501.9782 509.9769 570.3693 580.4862 650.7200 747.4376 754.3131 773.5798 884.7662 914.1719 964.1168 996.2435 1036.0449 1100.1780 1177.2948 1193.5016 1267.1864 1291.0812 1361.8634 1434.0607 1475.8156 1563.7446 1598.6440 2176.2046 2187.3460 3145.9608 3157.5059 3170.8788 3181.5301
redmass: 11.7252 6.6336 6.3570 9.9789 6.4191 10.6750 10.3252 4.2818 12.1498 9.8761 3.9335 8.8871 4.3296 7.4015 7.1291 3.9557 6.8027 1.2733 1.4363 8.5333 1.3800 1.3441 2.2419 2.2188 1.0734 2.3724 1.8272 2.3996 10.8269 2.3738 2.7821 6.6237 6.1760 12.6807 12.8420 1.0865 1.0907 1.0955 1.1011
irintensity: 0.7667 0.4824 0.3925 1.4545 0.1765 1.1623 1.4049 0.0064 0.5385 0.0468 9.9376 3.1219 1.0588 1.9658 21.4004 0.3469 17.2487 99.6573 0.0455 30.9639 4.0169 0.0469 2.7335 4.0703 1.3236 0.8519 3.2393 2.0789 3.4738 16.9158 63.2611 15.3879 33.0983 321.7203 1121.7731 1.5411 4.5639 8.0216 10.5997
temp: 298.150 k
press: 1.00000 atm
elementType: 16 7 7 6 6 6 6 6 6 6 6 1 1 1 1
symmnumber: 1
zpe: 256570.8 jmol-1
zpe.correction: 0.097723 hartree
zpe.thermalcorrener: 0.107232 hartree
zpe.thermalcorrenthalpy: 0.108176 hartree
zpe.thermalcorrgfe: 0.060934 hartree
zpe.sumelectzpe: -814.062366 hartree
zpe.sumelectthermal: -814.052856 hartree
zpe.sumelectthermalent: -814.051912 hartree
zpe.sumelectthermalfe: -814.099155 hartree
dipole: 4.7274 -3.9079 0.0009
dipole: 6.1335
quadrupole: -63.9719 -75.1285 -71.9644
quadrupole: 0.2496 0.0070 0.0071
quadrupole: 6.3830 -4.7736 -1.6095 0.2496 0.0070 0.0071
hfenergy: -814.1600886 hartree
pointgroup: C01 [X(C8H4N2S1)]
dipole: -2.0995701 1.1893057 0.0224452 debye
dipolederiv: -1.2654221 -0.3123221 -0.0962161 -0.2326244 -0.0888751 -0.0177472 -0.0881681 -0.0219223 -0.0406919 -2.6891013 -0.619355 -0.2026124 -0.4275662 -0.2446597 -0.0462208 -0.1817995 -0.0559603 -0.0327943 -0.1702544 0.0951098 0.0136525 -0.0151583 -0.344101 -0.0126895 0.0016739 -0.0070295 -0.2357748 1.5820205 0.4139781 0.1207382 0.1610874 0.2814744 0.0287271 0.0938882 0.0415594 0.1008227 -0.1269016 0.1195953 0.0013839 -0.1491976 -0.021526 -0.0203062 -0.0278206 -0.0065452 0.0946764 -0.4796846 -0.0389974 -0.0209717 0.1868506 0.0697142 0.0332255 0.003292 0.0216009 -0.1493763 -0.0151567 -0.1174565 -0.0074456 0.1359024 0.0926777 0.0295474 0.019899 0.016837 -0.1166419 0.2018581 0.0094402 0.0174338 -0.0142158 0.1285132 0.026279 0.0150338 0.0273425 -0.118844 0.0172682 0.0347439 0.0122352 -0.0871689 -0.2362035 -0.013017 -0.0011132 -0.0068402 -0.1574479 -0.0071354 -0.2407329 -0.028155 -0.0231491 0.2474013 0.0219962 -0.0046624 0.0108983 0.0355987 2.8959265 0.6852885 0.2236459 0.4946975 0.0917733 0.0407136 0.203368 0.0504562 -0.0369556 0.0715785 -0.0603007 -0.0115297 -0.0462331 -0.0214296 -0.0231711 -0.0102076 -0.0238397 0.1695687 0.0697354 -0.032794 -0.0082795 -0.0582073 -0.0261527 -0.023402 -0.0108819 -0.0221573 0.1615744 0.0026605 0.07969 0.0005951 0.1024746 -0.0111912 -0.0132873 0.0031155 -0.0143809 0.1591684 -0.0873914 -0.0158872 -0.0144747 -0.0274919 0.0825847 -0.0106477 -0.0156172 -0.010019 0.1671174 unknown
polarizability: 215.0177854|8.0936473|117.2614044|9.6586371|8.5890318|42.7930212 unknown
InChI: InChI=1S/C8H4N2S/c9-5-7-3-1-2-4-8(7)10-6-11/h1-4H
charge 0 multiplicity 1
15 atoms
S  4.098756 1.235644 0.285503
N  1.310556 0.7712 0.093416
N  1.088328 -2.836096 -0.307553
C  -0.041334 0.551454 0.000584
C  -0.551044 -0.780603 -0.168174
C  -0.948858 1.642756 0.072493
C  -1.95333 -0.984812 -0.260281
C  -2.335757 1.417513 -0.021406
C  -2.842477 0.105366 -0.187696
C  0.350246 -1.896773 -0.243571
C  2.502012 0.964766 0.174693
H  -0.549151 2.652754 0.201046
H  -2.329404 -2.00435 -0.388571
H  -3.023206 2.26769 0.035305
H  -3.921036 -0.063908 -0.259487
