program: Gaussian 09
title: 000151397
version: EM64L-G09RevD.01
frameworkgroup: C1[X(C9H11NO3)]
method: RPBEPBE
basis: SDD
operation: Freq
keyword: #p
keyword: freq=noraman
keyword: PBEPBE/SDD
title: #p freq=noraman PBEPBE/SDD
converged: YES YES NO NO
title: Mulliken charges:
elementType: O O O N C C C C C C C C C H H H H H H H H H H H
charge: -0.418511 -0.413813 -0.226018 -0.641518 -0.174103 -0.174459 0.414644 -0.449033 -0.384764 0.138186 -0.218547 -0.229349 -0.236945 0.233714 0.251510 0.231927 0.302860 0.285359 0.275506 0.224959 0.226629 0.228313 0.368272 0.385181
chargesum: 0.00000
title: Mulliken charges with hydrogens summed into heavy atoms:
elementType: O O O N C C C C C C C C C
charge: -0.050238 -0.028633 -0.226018 -0.080653 0.059611 0.077051 0.414644 -0.217106 -0.081904 0.138186 0.006412 -0.002719 -0.008632
polarizability: 1.22809695e+02 9.77396943e+00 1.11108632e+02 -1.69572185e+01 9.88127348e+00 9.05182904e+01
1716.lowfreq: -4.9295 0.0007 0.0009 0.0009 3.3046 9.0280 26.8197 52.3826 65.4530
frequency: 26.6424 52.3033 65.4414 101.6648 160.9416 185.1436 205.9318 233.9481 258.4709 288.2123 344.6762 377.1273 410.4991 419.6403 432.0300 490.2315 532.1938 582.0714 615.3346 620.2263 659.2890 704.1506 715.6406 774.5341 802.8411 858.6205 862.6676 911.0685 932.8601 982.9609 989.9384 999.1285 1010.4721 1024.4789 1059.4237 1074.5837 1108.0013 1150.1202 1171.9515 1182.4510 1197.7095 1223.7054 1236.6752 1295.0396 1314.5331 1337.2356 1365.2656 1386.5382 1390.9455 1443.7032 1480.5975 1593.4852 1611.8284 1634.1893 1657.3436 2882.1498 3035.9306 3112.5298 3125.5094 3139.2552 3156.0443 3167.0636 3495.7506 3508.1203 3513.8509 3632.2578
redmass: 5.9385 4.2350 7.4096 5.9101 2.4609 1.7353 3.7065 1.8076 2.9087 3.1836 2.2746 4.2407 2.8104 2.2227 2.0681 4.4641 2.6499 2.2764 5.3691 2.8071 2.9655 3.1034 1.8759 2.4784 3.7954 1.7819 1.9210 3.7399 1.4544 1.3874 6.1395 1.3581 3.5702 2.2726 2.0875 1.7647 2.3126 1.6819 1.0566 1.1191 1.7157 1.3141 1.4486 1.9557 1.3556 1.2690 2.1031 1.3308 3.6224 2.1211 2.3444 6.0373 5.3750 1.1367 8.6940 1.0822 1.0847 1.0873 1.0868 1.0926 1.0965 1.0988 1.0446 1.0642 1.0651 1.1003
irintensity: 0.4138 0.8399 0.1280 2.8953 11.7378 5.1351 8.9688 101.5801 22.0290 10.1006 100.7120 9.4797 2.7935 64.4089 154.4566 20.0605 17.1878 110.3181 8.6747 33.3424 72.0906 15.2494 57.6620 33.8921 5.0636 7.2266 5.8338 4.9308 2.4142 1.2888 1.0463 6.7024 182.7985 10.2173 140.2035 6.8150 5.8712 14.4764 0.2649 1.3109 2.5124 31.5549 4.2445 52.3940 11.4064 8.8652 13.9779 15.4803 6.1886 15.9855 11.1945 0.4175 4.6449 41.6071 214.8084 52.1230 24.3965 8.3348 1.5737 30.6070 22.5488 12.3247 2.9846 24.3730 14.5571 2.3051
temp: 298.150 k
press: 1.00000 atm
elementType: 8 8 8 7 6 6 6 6 6 6 6 6 6 1 1 1 1 1 1 1 1 1 1 1
symmnumber: 1
zpe: 492354.1 jmol-1
zpe.correction: 0.187528 hartree
zpe.thermalcorrener: 0.200445 hartree
zpe.thermalcorrenthalpy: 0.201389 hartree
zpe.thermalcorrgfe: 0.147399 hartree
zpe.sumelectzpe: -628.998968 hartree
zpe.sumelectthermal: -628.986050 hartree
zpe.sumelectthermalent: -628.985106 hartree
zpe.sumelectthermalfe: -629.039097 hartree
dipole: -0.1007 -0.7619 -2.9889
dipole: 3.0862
quadrupole: -69.4953 -71.3669 -77.5984
quadrupole: -1.1507 -7.7012 0.7829
quadrupole: 3.3249 1.4533 -4.7782 -1.1507 -7.7012 0.7829
hfenergy: -629.1864954 hartree
pointgroup: C01 [X(C9H11N1O3)]
dipole: -0.0964568 -0.320714 -1.1670877 debye
dipolederiv: -0.5242671 0.1035161 -0.0631119 0.1672837 -0.2844783 -0.0854929 -0.1949366 -0.0923553 -0.7086977 -0.6248587 0.1234083 0.3220478 0.2307935 -0.3645284 -0.3405358 0.3599075 -0.2672973 -0.8546207 -0.3676713 0.0519346 0.1482203 0.1206 -0.6681508 0.3362085 0.1189879 0.0941144 -0.7881528 -0.3636624 0.0684892 0.0810338 0.0650932 -0.7721634 -0.0126442 0.1063822 0.0011281 -0.604407 0.2549449 -0.1458589 -0.0975846 -0.0228383 0.6671442 -0.0951482 -0.0594318 -0.3069413 0.3537936 0.2549832 0.106602 -0.0583192 0.0644575 -0.0895319 0.1534428 0.0618811 0.2684851 0.4801528 0.1552026 0.0476317 0.0093564 0.0941006 -0.0923514 0.04278 -0.0628955 0.0223892 -0.0966034 -0.0988194 -0.0326401 -0.0962832 -0.0199745 -0.0556098 0.0679876 -0.0595752 0.0798484 -0.053937 -0.1195843 0.0585171 0.0153523 0.045074 -0.005577 0.0687496 0.0298066 0.0434204 -0.1038896 0.4648076 -0.1442459 -0.4766488 -0.5005699 0.9943385 -0.1807168 -0.4886945 0.0369392 1.1736161 -0.0655214 0.0699431 -0.001153 0.0819496 0.0639666 0.0916921 0.0000406 0.0912966 -0.0736178 -0.0165436 -0.0314002 -0.1196134 -0.0333058 -0.0364659 0.0895544 -0.1166119 0.1085854 0.0024871 0.024322 0.0839179 -0.0847604 0.0746682 -0.0616519 0.0176454 -0.0848143 0.0057936 -0.0853555 -0.0134182 0.037601 0.0190531 0.040499 -0.1394209 -0.0890754 0.0560632 -0.0917428 -0.1117291 -0.0876394 -0.0644967 0.07667 -0.0711199 0.0340494 0.0250252 0.0340567 -0.0087956 0.0283649 0.0397895 0.048977 0.1185008 0.0314161 0.0633365 -0.0656169 0.103568 -0.0790438 0.0158552 0.1267508 -0.0444935 -0.0109087 -0.0359056 0.0278879 -0.0571761 -0.0248077 -0.0552333 0.1110129 0.1666609 -0.0048554 -0.0912016 0.006448 0.1806724 0.0340794 -0.1888592 0.0911918 0.1991774 0.0323899 -0.0733981 0.0331691 -0.0312263 0.1758442 0.0632116 0.0894944 0.1051113 0.2940664 0.0670116 -0.0786701 0.0003107 -0.0960399 -0.0572425 -0.0940813 -0.0048428 -0.0977729 0.0875329 0.0293659 0.0331122 0.1009944 0.0365617 0.0518064 -0.0942847 0.1207977 -0.0876623 0.0128233 -0.0688157 -0.0931713 0.0860376 -0.0951209 0.0729124 0.0043964 0.0883937 0.0036483 0.1010266 0.3244989 -0.0979009 0.0796493 -0.1824986 0.1805901 0.0570557 0.1228769 0.0356196 0.3274266 0.4100737 -0.022519 0.0091891 0.0296547 0.1146237 0.0629433 -0.0067871 0.0992732 0.2936747 unknown
polarizability: 120.6748001|10.0933881|111.6964013|-18.8412365|8.7770486|92.0654158 unknown
InChI: InChI=1S/C9H11NO3/c10-7(8(11)9(12)13)6-4-2-1-3-5-6/h1-5,7-8,11-12H,10H2
charge 0 multiplicity 1
24 atoms
O  1.612603 1.173537 1.443896
O  2.775284 -1.294032 -0.995707
O  1.932878 -1.567099 1.156422
N  0.610248 2.382485 -1.127197
C  0.721859 0.935184 -0.938685
C  1.878495 0.667755 0.115493
C  -0.60739 0.352254 -0.464124
C  -1.089511 -0.871236 -0.990934
C  -1.360653 1.022747 0.53438
C  2.189593 -0.826781 0.182685
C  -2.304628 -1.42339 -0.525633
C  -2.575706 0.471376 0.998112
C  -3.050159 -0.753635 0.471974
H  1.039795 0.384708 -1.856985
H  2.776829 1.205205 -0.240222
H  -0.517204 -1.387829 -1.772328
H  -0.982676 1.976256 0.916588
H  -0.197421 2.696418 -1.666777
H  1.475782 2.887734 -1.324097
H  -2.670965 -2.368461 -0.942315
H  -3.152796 0.994159 1.769536
H  -3.993728 -1.179603 0.831627
H  1.084381 0.492267 1.939595
H  2.949991 -2.271419 -0.917907
