program: Gaussian 09
title: 000151396
version: EM64L-G09RevD.01
frameworkgroup: C1[X(C11H15N3O3S)]
method: RPBEPBE
basis: SDD
operation: Freq
keyword: #p
keyword: freq=noraman
keyword: PBEPBE/SDD
title: #p freq=noraman PBEPBE/SDD
converged: YES YES NO NO
title: Mulliken charges:
elementType: S O O O N N N C C C C C C C C C C C H H H H H H H H H H H H H H H
charge: 0.114273 -0.241817 -0.219968 -0.214837 -0.434931 -0.544394 0.019937 -0.272675 -0.369703 -0.681660 0.147695 0.493679 -0.425742 -0.319201 0.391247 -0.347260 -0.362966 -0.826128 0.255178 0.229032 0.259785 0.272825 0.281519 0.314130 0.286659 0.274403 0.240529 0.316432 0.286777 0.286720 0.260000 0.260731 0.269730
chargesum: 0.00000
title: Mulliken charges with hydrogens summed into heavy atoms:
elementType: S O O O N N N C C C C C C C C C C C
charge: 0.114273 -0.241817 -0.219968 -0.214837 -0.120801 0.016669 0.019937 -0.017497 0.119114 -0.127316 0.147695 0.493679 -0.185213 -0.002769 0.391247 -0.060483 -0.076246 -0.035667
polarizability: 2.70626101e+02 2.41431465e+01 1.83421215e+02 7.49338795e+00 -1.84527717e+01 1.06880621e+02
1716.lowfreq: -12.5552 -5.1086 -3.8546 -0.0017 -0.0012 0.0010 20.3907 34.1237 42.6738
frequency: 20.1891 34.0538 42.5964 68.6793 72.3458 82.1149 108.1227 118.4083 120.6860 146.9054 177.6122 193.2040 202.3882 216.4574 231.1552 283.9980 313.4557 316.6411 346.1860 355.2534 416.9673 419.2469 503.9564 508.5845 512.6007 613.1164 620.5442 635.1836 658.2300 661.7035 668.8010 714.5318 724.3396 740.1498 765.0466 788.8361 812.4203 833.7478 852.5904 881.2381 898.3186 936.0233 967.1346 979.4484 983.0658 999.1752 1011.2244 1012.9624 1060.2118 1095.6167 1115.6944 1131.5598 1142.5561 1152.1691 1160.1519 1176.9065 1224.2066 1243.5321 1274.9725 1281.8381 1297.4765 1305.6196 1331.0075 1347.3543 1351.6675 1369.4544 1392.3325 1430.7608 1449.3434 1449.8686 1452.8537 1460.9176 1487.5132 1529.7237 1594.1399 1614.3132 1632.3891 1656.3501 2988.8122 3005.9425 3008.1973 3014.3831 3067.3062 3089.5679 3121.4269 3130.6566 3137.1186 3177.5132 3184.2348 3199.4716 3282.6654 3426.0403 3546.4298
redmass: 3.9548 5.2265 5.0160 8.5451 5.5216 5.8606 5.0870 1.5921 5.5307 2.1456 3.9343 3.6326 2.0093 3.9924 2.1584 2.8735 2.9357 5.2679 3.9147 6.2195 3.2392 5.7509 3.6408 7.1831 3.4213 3.5265 6.1224 7.4891 3.1698 7.4231 4.7665 4.7673 1.5452 4.4082 7.1601 1.3384 2.6328 2.6564 1.3708 1.5511 3.0166 2.0120 1.2370 1.3210 1.3428 3.0996 1.3265 1.6558 2.1677 3.1017 1.3015 1.6812 2.5409 1.3971 1.7913 1.4110 4.5722 1.5877 1.6088 1.5616 1.4247 1.2676 1.3723 1.1877 4.7739 1.5290 4.8968 4.8212 1.0552 1.0785 1.0879 1.0576 2.6237 2.3091 7.7701 5.0643 3.2571 1.0863 1.0655 1.0321 1.0796 1.0581 1.1000 1.1066 1.1055 1.0909 1.1031 1.0904 1.0946 1.0962 1.0801 1.0457 1.0953
irintensity: 2.4505 0.1086 0.5809 3.4822 3.0871 1.7659 2.7582 2.9215 2.3718 6.6051 1.8845 0.8823 17.7007 2.3349 33.5471 2.1127 37.4280 10.0044 3.1974 11.4395 0.5151 4.1958 2.7913 1.2153 13.5676 8.7215 2.8393 5.8860 28.7690 3.0810 24.5498 1.6432 314.2836 0.8001 43.8294 39.2500 35.0057 21.0741 74.8040 84.5428 8.8602 4.0857 16.5368 6.8021 0.3645 0.0811 0.3036 2.4947 8.1738 20.5020 21.1791 11.4633 88.1450 31.0817 74.0892 163.0305 468.8423 3.7294 40.9604 26.7731 70.0354 5.1564 3.7756 9.3595 68.0656 26.4349 138.2056 26.1072 11.9179 17.3547 9.2297 8.1082 47.0414 377.2052 120.3240 131.7866 124.4993 37.2824 8.7747 31.5606 20.5753 19.6872 7.6285 31.6227 16.7116 10.9327 7.0468 1.9148 2.5297 3.5514 421.4018 2.7071 4.8402
temp: 298.150 k
press: 1.00000 atm
elementType: 16 8 8 8 7 7 7 6 6 6 6 6 6 6 6 6 6 6 1 1 1 1 1 1 1 1 1 1 1 1 1 1 1
symmnumber: 1
zpe: 670877.2 jmol-1
zpe.correction: 0.255524 hartree
zpe.thermalcorrener: 0.274325 hartree
zpe.thermalcorrenthalpy: 0.275269 hartree
zpe.thermalcorrgfe: 0.206209 hartree
zpe.sumelectzpe: -1214.737324 hartree
zpe.sumelectthermal: -1214.718523 hartree
zpe.sumelectthermalent: -1214.717579 hartree
zpe.sumelectthermalfe: -1214.786639 hartree
dipole: -6.4343 2.5435 -0.0011
dipole: 6.9187
quadrupole: -158.1973 -108.8896 -110.2034
quadrupole: -5.4970 -6.2755 4.3338
quadrupole: -32.4339 16.8738 15.5600 -5.4970 -6.2755 4.3338
hfenergy: -1214.9928479 hartree
pointgroup: C01 [X(C11H15N3O3S1)]
dipole: 2.5892118 0.8160684 0.1988606 debye
polarizability: 265.6041325|-31.85411|184.2874961|14.9602176|21.8048965|111.0363084 unknown
InChI: InChI=1S/C11H15N3O3S/c1-18-7-6-10(12)11(15)13-8-2-4-9(5-3-8)14(16)17/h2-5,10,13H,6-7,12H2,1H3
charge 0 multiplicity 1
33 atoms
S  3.482615 1.910108 0.681889
O  1.423579 -2.471591 -0.556912
O  -4.9415 1.805697 0.128821
O  -5.207879 -0.198293 -0.933387
N  1.053841 -0.392219 0.48792
N  3.964898 -2.677416 0.713765
N  -4.483468 0.680447 -0.319513
C  3.344126 -1.359336 0.523133
C  4.169646 -0.567702 -0.536431
C  3.661916 0.841161 -0.888809
C  1.849779 -1.471911 0.094115
C  -0.323836 -0.178092 0.259794
C  -0.882801 1.044693 0.738079
C  -1.157594 -1.119553 -0.412085
C  -3.052579 0.38502 -0.118353
C  -2.242267 1.330581 0.552262
C  -2.520472 -0.833075 -0.597326
C  2.786168 3.470333 -0.113412
H  3.400137 -0.811515 1.483609
H  4.19591 -1.163238 -1.471349
H  5.204955 -0.522653 -0.154697
H  2.674774 0.815974 -1.383178
H  4.382228 1.351719 -1.549657
H  1.570895 0.389411 0.931215
H  3.791819 -3.292852 -0.092716
H  3.667917 -3.140237 1.580909
H  -0.242046 1.763127 1.263377
H  -0.722257 -2.051362 -0.775954
H  -2.689694 2.260111 0.912944
H  -3.180702 -1.53812 -1.109327
H  2.599913 4.186629 0.701286
H  1.844177 3.247018 -0.639552
H  3.523802 3.892438 -0.813262
