program: Gaussian 09
title: 000151413
version: EM64L-G09RevD.01
frameworkgroup: C1[X(C11H16NO5P)]
method: RPBEPBE
basis: SDD
operation: Freq
keyword: #p
keyword: freq=noraman
keyword: PBEPBE/SDD
title: #p freq=noraman PBEPBE/SDD
converged: YES YES NO NO
title: Mulliken charges:
elementType: P O O O O O N C C C C C C C C C C C H H H H H H H H H H H H H H H H
charge: 1.397624 -0.554568 -0.513216 -0.501072 -0.603636 -0.277184 -0.634803 0.387774 -0.361269 -0.373721 -0.227178 -0.216568 0.306902 -0.324934 -0.343336 -0.649073 -0.657188 0.150109 0.243285 0.220796 0.241473 0.226930 0.293759 0.256195 0.212982 0.281413 0.212421 0.231281 0.237648 0.211115 0.232171 0.238938 0.317831 0.337099
chargesum: 0.00000
title: Mulliken charges with hydrogens summed into heavy atoms:
elementType: P O O O O O N C C C C C C C C C C C
charge: 1.397624 -0.554568 -0.513216 -0.501072 -0.603636 -0.277184 0.020128 0.387774 -0.067510 -0.117526 0.236903 0.251835 0.306902 -0.111952 -0.061923 0.032277 0.025036 0.150109
polarizability: 2.37171925e+02 -1.20871488e+01 1.31126071e+02 -2.31189573e-01 1.57070474e+01 1.51130483e+02
1716.lowfreq: -5.2743 -2.7495 -0.0012 -0.0009 -0.0009 3.9797 11.5058 16.2882 17.2872
frequency: 11.0059 15.8906 16.9497 36.9662 44.5491 50.2768 66.2869 74.1666 98.0590 118.7279 145.6877 182.0744 201.7487 236.0366 238.4377 245.2155 267.7930 274.7736 299.1690 325.5578 356.7875 381.9576 408.6204 433.0556 452.4165 465.0728 479.4974 501.4958 563.9744 580.3365 599.4433 630.5419 646.9789 690.5674 706.1245 738.1147 757.9070 807.0102 811.9763 831.1637 840.3955 864.5706 868.0016 881.5876 959.8940 991.8058 1006.0816 1010.0478 1016.3354 1044.6123 1055.9355 1103.3276 1107.2909 1115.8226 1122.4978 1133.2633 1133.9400 1172.3937 1205.1685 1252.1256 1254.4483 1301.0495 1349.4830 1354.6771 1356.9803 1374.5855 1395.5719 1397.1430 1414.3777 1457.6299 1457.6737 1477.4947 1479.3561 1488.9719 1490.1543 1493.7373 1564.4488 1593.6423 1611.0722 1634.2420 2994.8038 2996.4090 2999.8962 3006.5517 3064.0790 3075.0743 3092.3134 3093.6253 3112.3436 3115.1526 3129.0803 3156.9585 3160.8311 3177.6791 3530.6513 3683.7527
redmass: 4.2283 2.0679 4.5399 3.0505 4.2906 4.1414 3.1168 2.4467 6.3277 5.1404 5.5341 8.0532 3.5081 4.7262 1.2589 1.4204 5.0155 3.4337 4.4269 6.5043 5.8136 5.6982 2.7504 5.4205 5.0961 2.2762 2.4247 2.1434 4.0999 1.4004 5.3979 6.9312 5.7985 3.5651 5.8166 5.8207 4.0422 1.0982 1.0880 1.6804 3.3690 1.6991 3.8193 4.9076 1.3656 1.3622 3.0610 2.4458 2.5251 1.9499 11.8059 2.2162 2.2827 1.3896 2.6517 1.4009 1.4411 1.9275 1.7045 1.1522 1.1444 1.2780 3.6523 1.2804 1.2502 6.5656 1.2418 1.2434 3.7100 1.0395 1.0398 1.0528 1.0529 1.0936 1.1253 2.2573 4.5151 2.5529 6.2392 2.1420 1.0382 1.0363 1.0552 1.0579 1.1081 1.1070 1.0979 1.0978 1.1026 1.1030 1.0891 1.0887 1.0960 1.0970 1.0448 1.1039
irintensity: 2.5003 0.7600 6.4342 1.0668 8.3433 2.5478 1.5007 3.8247 3.2473 2.8771 1.3907 1.5615 1.6506 4.9692 1.2918 1.4411 17.5901 12.2720 20.7120 10.2714 24.9782 13.5738 3.1773 8.7611 28.9197 25.7999 9.3881 171.0570 15.7047 62.0156 31.5521 16.5388 113.2546 43.5887 114.9980 94.8950 34.5887 7.2310 2.2835 46.4761 218.4070 29.5396 164.1511 290.7390 2.0419 1.3456 30.9151 167.5772 84.2040 2.4320 97.5434 12.9643 28.3871 14.8936 6.8753 4.6868 3.0463 209.6490 84.0120 0.6042 1.1182 12.0576 315.5234 5.2511 4.3753 29.1659 24.1577 27.5663 17.3512 8.4616 16.3630 6.8292 4.5659 10.3242 21.9098 74.0095 111.3673 33.6632 129.2781 254.8051 15.5071 18.9149 38.1448 21.1130 9.5184 7.1971 25.0369 25.0675 31.8418 37.7292 17.6679 0.0871 1.4386 4.1575 42.0987 29.7688
temp: 298.150 k
press: 1.00000 atm
elementType: 15 8 8 8 8 8 7 6 6 6 6 6 6 6 6 6 6 6 1 1 1 1 1 1 1 1 1 1 1 1 1 1 1 1
symmnumber: 1
zpe: 687933.2 jmol-1
zpe.correction: 0.262020 hartree
zpe.thermalcorrener: 0.282662 hartree
zpe.thermalcorrenthalpy: 0.283606 hartree
zpe.thermalcorrgfe: 0.207437 hartree
zpe.sumelectzpe: -1199.496822 hartree
zpe.sumelectthermal: -1199.476180 hartree
zpe.sumelectthermalent: -1199.475236 hartree
zpe.sumelectthermalfe: -1199.551405 hartree
dipole: 2.2567 1.1603 0.0257
dipole: 2.5377
quadrupole: -107.7335 -104.6722 -117.8913
quadrupole: -2.5990 -32.4837 3.1163
quadrupole: 2.3655 5.4267 -7.7923 -2.5990 -32.4837 3.1163
hfenergy: -1199.758842 hartree
pointgroup: C01 [X(C11H16N1O5P1)]
dipole: 0.9244411 0.3754883 -0.0351792 debye
polarizability: 234.2118063|-20.8450642|138.6963372|4.8084208|17.2538561|146.520335 unknown
InChI: InChI=1S/C11H16NO5P/c1-3-15-18(14,16-4-2)17-10-7-5-9(6-8-10)11(12)13/h5-8H,3-4,12H2,1-2H3
charge 0 multiplicity 1
34 atoms
P  2.333777 0.150682 0.69453
O  1.052301 -0.887861 0.126353
O  2.542236 1.12488 -0.717986
O  3.602478 -0.987906 0.725921
O  2.138972 0.937796 2.05504
O  -5.101306 0.241663 -1.449329
N  -5.208095 0.937116 0.755468
C  -0.305913 -0.479022 0.056072
C  -0.908653 0.317597 1.057021
C  -1.047067 -0.960855 -1.045085
C  3.049247 2.529041 -0.556694
C  3.870252 -1.864191 -0.466262
C  -3.049709 0.146529 -0.14954
C  -2.279473 0.628082 0.94042
C  -2.414376 -0.645854 -1.140596
C  2.679561 3.261566 -1.841967
C  5.143147 -2.633053 -0.132268
C  -4.515154 0.441622 -0.339936
H  2.578215 2.98023 0.335733
H  4.144012 2.486751 -0.405558
H  3.000017 -2.529425 -0.603913
H  3.988528 -1.222058 -1.359037
H  -0.31771 0.684962 1.902273
H  -0.543973 -1.566905 -1.803774
H  -2.72479 1.274458 1.705771
H  -3.017694 -0.992249 -1.985698
H  3.048119 4.303239 -1.795366
H  3.134226 2.77014 -2.718705
H  1.585529 3.28162 -1.97938
H  5.391736 -3.318885 -0.963471
H  5.990691 -1.944299 0.021264
H  5.006028 -3.230191 0.784688
H  -4.800884 1.012895 1.684417
H  -6.197172 1.148682 0.630293
