program: Gaussian 09
title: 000151412
version: EM64L-G09RevD.01
frameworkgroup: C1[X(C14H17N3O2)]
method: RPBEPBE
basis: SDD
operation: Freq
keyword: #p
keyword: freq=noraman
keyword: PBEPBE/SDD
title: #p freq=noraman PBEPBE/SDD
converged: YES YES NO NO
title: Mulliken charges:
elementType: O O N N N C C C C C C C C C C C C C C H H H H H H H H H H H H H H H H H
charge: -0.282402 -0.325807 -0.404592 -0.379211 -0.371693 -0.636428 -0.189612 0.415092 0.070644 0.231051 -0.436144 0.246531 -0.426800 -0.350744 -0.266109 -0.217631 0.279877 -0.619439 -0.768785 0.265529 0.236320 0.277934 0.272324 0.307932 0.336074 0.245938 0.229498 0.224899 0.224589 0.364539 0.225811 0.224730 0.266688 0.253674 0.250850 0.224871
chargesum: 0.00000
title: Mulliken charges with hydrogens summed into heavy atoms:
elementType: O O N N N C C C C C C C C C C C C C C
charge: -0.282402 -0.325807 -0.096660 -0.043137 -0.007154 -0.134578 0.088322 0.415092 0.070644 0.231051 -0.163820 0.246531 -0.180862 -0.121247 -0.041210 0.006958 0.279877 0.097791 -0.039390
polarizability: 2.18031419e+02 2.07572630e+01 1.44188580e+02 9.20281551e+00 1.34541214e+01 1.64718280e+02
1716.lowfreq: -5.6498 -0.0006 -0.0005 -0.0005 0.6041 5.9219 24.8420 34.6830 47.0502
frequency: 24.5697 34.6408 47.0090 60.9084 74.1883 89.3003 94.3041 116.9181 138.6309 166.7782 191.1527 200.5341 217.6694 230.3164 261.7633 309.5690 319.8417 355.5913 423.6730 428.4524 452.6940 500.6780 520.2246 536.4481 560.1243 575.8351 577.9142 591.9253 606.5580 636.1207 658.1000 739.5736 747.9363 751.9622 755.4567 772.7167 808.9279 838.1028 850.8818 853.4317 867.2508 911.2400 933.1469 941.0626 972.1937 981.1515 1007.5953 1011.6664 1045.2679 1055.9361 1086.1247 1097.0981 1107.5787 1120.3313 1134.4588 1150.9663 1167.9051 1182.3444 1236.8664 1239.5453 1255.8670 1278.2060 1284.5055 1300.4702 1329.2970 1336.2179 1349.8910 1392.0344 1392.4668 1417.4836 1422.1072 1450.5899 1459.0850 1461.7435 1467.2867 1470.6152 1480.9826 1485.5110 1492.9509 1549.8361 1562.2903 1584.2315 1588.9621 1630.4945 1634.2192 2977.2591 2998.5207 2998.8571 3013.0914 3054.9570 3068.3115 3097.3189 3104.7159 3107.5632 3115.5755 3128.5158 3143.2331 3162.7913 3220.0753 3303.7673 3518.3816 3611.9283
redmass: 4.4939 4.7563 4.6046 4.5600 1.5081 1.9321 1.0628 5.2794 4.2453 4.1064 3.9687 4.0884 4.0686 3.5717 3.8669 4.9660 4.8826 5.0654 2.9307 3.2055 3.2743 3.2723 1.3733 5.5985 3.1823 3.6213 2.6346 2.9012 1.7239 3.1205 4.6875 4.8072 3.7538 1.4215 4.3053 3.5464 1.5913 1.8642 1.3690 1.4439 4.8217 2.7869 1.4229 4.5443 1.3097 2.2823 1.8599 2.2052 1.6491 3.4172 2.7330 1.6225 3.1345 1.3642 1.5089 1.7649 1.1261 1.4918 2.4552 1.6405 1.5975 1.6701 1.8285 2.0329 1.5702 1.3369 1.8047 1.2485 5.2921 1.1757 2.2907 1.0514 3.3112 1.2459 1.1337 1.0897 3.0274 1.0468 1.9304 1.6729 5.9473 6.1380 4.1441 6.7138 5.5733 1.0349 1.0503 1.0687 1.0616 1.1016 1.1005 1.0982 1.1010 1.0987 1.0874 1.0875 1.0941 1.0998 1.0985 1.0834 1.0790 1.0809
irintensity: 0.2105 1.3941 0.8560 3.6627 3.7563 4.0795 0.3451 7.7155 5.0030 14.6925 2.3513 3.0135 9.9481 2.8359 5.0225 0.4976 4.9340 19.3929 7.8396 15.2758 7.6403 2.4368 95.7496 3.8099 7.8674 19.8259 27.5443 40.3289 33.7745 0.8566 5.1405 15.1810 3.1757 110.2859 11.8573 10.7513 20.9039 44.5403 80.5430 3.6024 1.9624 3.2122 6.3444 2.2746 0.1321 1.0710 0.9395 10.6353 11.7661 6.5115 3.7469 37.4993 9.5890 1.2082 0.0452 51.7241 0.0942 2.4138 4.1350 4.7084 33.8452 17.7469 25.8019 6.2669 3.7041 5.7066 28.5151 49.7593 41.8545 24.8680 2.9037 15.1205 20.8995 119.5461 39.8254 24.3973 3.1625 16.0386 176.5498 253.8545 0.5494 0.2367 40.6804 11.9454 253.7606 80.2531 2.5866 11.9669 8.2583 35.7744 14.2150 8.7472 15.6873 6.3646 7.2390 1.3304 29.0707 27.1188 0.6750 236.2694 106.3637 63.8896
temp: 298.150 k
press: 1.00000 atm
elementType: 8 8 7 7 7 6 6 6 6 6 6 6 6 6 6 6 6 6 6 1 1 1 1 1 1 1 1 1 1 1 1 1 1 1 1 1
symmnumber: 1
zpe: 766048.8 jmol-1
zpe.correction: 0.291773 hartree
zpe.thermalcorrener: 0.310215 hartree
zpe.thermalcorrenthalpy: 0.311159 hartree
zpe.thermalcorrgfe: 0.243543 hartree
zpe.sumelectzpe: -857.048167 hartree
zpe.sumelectthermal: -857.029725 hartree
zpe.sumelectthermalent: -857.028781 hartree
zpe.sumelectthermalfe: -857.096397 hartree
dipole: 3.5528 1.7229 -2.4162
dipole: 4.6291
quadrupole: -102.2370 -115.8265 -106.5422
quadrupole: 0.0133 -7.7108 14.0964
quadrupole: 5.9649 -7.6246 1.6598 0.0133 -7.7108 14.0964
hfenergy: -857.3399398 hartree
pointgroup: C01 [X(C14H17N3O2)]
dipole: -1.4512366 0.2518524 1.0711702 debye
polarizability: 217.7555792|-21.9868596|157.1981075|3.4760681|-17.8077608|151.9845924 unknown
InChI: InChI=1S/C14H17N3O2/c1-9(18)17-13(14(19)15-2)7-10-8-16-12-6-4-3-5-11(10)12/h3-6,8,13,15-17H,7H2,1-2H3
charge 0 multiplicity 1
36 atoms
O  3.017356 -1.204791 -1.88032
O  2.601571 1.110088 2.013992
N  -2.773955 -1.640782 1.166198
N  1.119827 0.646538 0.288498
N  4.018319 -0.367312 0.064484
C  0.526621 -1.604792 -0.631067
C  1.589756 -0.747115 0.105472
C  -0.875855 -1.440125 -0.099864
C  -1.871509 -0.499197 -0.591362
C  -3.050576 -0.643753 0.224877
C  -1.468087 -2.116314 0.967171
C  2.943048 -0.794665 -0.679075
C  -1.882309 0.448038 -1.653194
C  -4.214346 0.128677 0.01565
C  -3.039696 1.222628 -1.864403
C  -4.191748 1.066683 -1.036947
C  1.616927 1.465991 1.275553
C  5.374367 -0.296041 -0.488505
C  0.939837 2.818364 1.442292
H  0.575276 -1.356829 -1.707127
H  0.85562 -2.656451 -0.560147
H  1.773399 -1.149161 1.121144
H  -1.057787 -2.903279 1.597936
H  -3.421047 -1.979695 1.874422
H  0.306231 0.950063 -0.252855
H  -1.018209 0.552274 -2.321648
H  -5.105808 0.008682 0.641564
H  -3.065475 1.949818 -2.683395
H  -5.077617 1.682251 -1.228253
H  3.80531 0.048935 0.989186
H  6.080992 -0.887002 0.122811
H  5.734747 0.748976 -0.532033
H  5.350354 -0.708349 -1.510047
H  0.602073 2.922125 2.487566
H  1.674764 3.620443 1.255041
H  0.075327 2.958477 0.771483
