program: Gaussian 09
title: 000151366
version: EM64L-G09RevD.01
frameworkgroup: C1[X(C6H7N5O2)]
method: RPBEPBE
basis: SDD
operation: Freq
keyword: #pfreq=noraman
keyword: PBEPBE/SDD
title: #p freq=noraman PBEPBE/SDD
converged: YES YES NO NO
title: Mulliken charges:
elementType: O O N N N N N C C C C C C H H H H H H H
charge: -0.243786 -0.440726 -0.374977 -0.364958 -0.377663 -0.140030 -0.086881 0.082825 0.090154 0.254557 0.021543 -0.210877 -0.303497 0.329491 0.342237 0.304719 0.270575 0.218574 0.235711 0.393009
chargesum: 0.00000
title: Mulliken charges with hydrogens summed into heavy atoms:
elementType: O O N N N N N C C C C C C
charge: -0.243786 -0.047717 -0.045486 -0.022721 -0.072944 -0.140030 -0.086881 0.082825 0.090154 0.254557 0.021543 0.059699 0.150788
polarizability: 1.52009142e+02 3.29397452e+00 1.16246617e+02 4.09262567e+00 -1.07018190e+00 5.00950112e+01
1716.lowfreq: 0.0008 0.0009 0.0010 3.3579 8.3792 11.2518 65.1543 102.4639 131.6253
frequency: 65.1398 102.4531 131.6227 161.7112 195.6001 228.7311 280.5891 311.1460 330.1236 409.5544 474.8299 503.5301 550.0269 562.7651 612.2950 617.0034 658.4374 675.4524 699.4798 702.4985 722.4317 766.8664 797.0320 807.6164 920.2733 924.7751 975.9178 1003.3746 1048.3662 1081.8464 1118.9685 1150.8222 1231.6744 1241.8777 1269.0700 1332.1841 1336.3507 1353.6947 1384.7662 1406.3110 1410.7966 1451.7266 1474.8328 1513.3917 1539.1759 1602.2628 1621.7083 3009.6565 3113.8166 3252.2462 3400.0465 3546.8201 3552.4094 3585.5788
redmass: 7.0234 4.7928 5.4328 6.6664 4.0572 5.1204 5.5621 2.6978 3.6315 2.0012 4.0691 7.9690 5.3906 1.2390 4.0529 7.1567 2.4836 2.8054 1.5304 2.2425 3.5815 6.9004 5.6277 1.5393 4.1238 7.1642 4.9151 2.7762 2.6638 1.6984 3.6610 2.6358 1.5923 2.0872 1.8220 2.5952 3.4968 1.3192 2.9775 1.1764 2.6902 1.1175 2.0565 6.4485 3.8574 7.0747 10.1369 1.0644 1.1020 1.0993 1.0642 1.0781 1.0784 1.0826
irintensity: 2.6830 4.6673 6.0011 0.1751 2.1385 12.8821 30.0551 19.6961 16.8488 97.8727 13.3803 10.8073 7.7774 158.6552 9.6848 1.5859 91.5070 50.0881 57.5515 122.6943 70.1236 2.2872 8.8161 20.8475 6.4137 5.6102 157.4200 82.2253 79.7260 16.4051 72.6510 14.1874 43.0231 23.4873 38.2041 30.0078 69.0032 27.3015 54.4421 64.5981 51.5044 16.1105 180.1679 83.0701 229.8111 356.7974 414.1580 56.8949 32.9959 1.5302 64.7846 23.0147 77.2109 89.1180
temp: 298.150 k
press: 1.00000 atm
elementType: 8 8 7 7 7 7 7 6 6 6 6 6 6 1 1 1 1 1 1 1
symmnumber: 1
zpe: 384130.9 jmol-1
zpe.correction: 0.146308 hartree
zpe.thermalcorrener: 0.156955 hartree
zpe.thermalcorrenthalpy: 0.157899 hartree
zpe.thermalcorrgfe: 0.109727 hartree
zpe.sumelectzpe: -656.108829 hartree
zpe.sumelectthermal: -656.098182 hartree
zpe.sumelectthermalent: -656.097238 hartree
zpe.sumelectthermalfe: -656.145410 hartree
dipole: 2.6949 -4.9312 -0.7082
dipole: 5.6640
quadrupole: -65.1298 -79.5114 -77.6162
quadrupole: 17.5089 5.6657 0.6750
quadrupole: 8.9560 -5.4256 -3.5304 17.5089 5.6657 0.6750
hfenergy: -656.2551371 hartree
pointgroup: C01 [X(C6H7N5O2)]
dipole: -0.9653634 -1.744005 0.9961319 debye
dipolederiv: -0.5633135 0.1145569 -0.0519463 0.0962758 -1.1920311 0.2730187 -0.0515685 0.2938409 -0.4804584 -0.6846824 -0.1567368 -0.0382854 -0.2844402 -0.5123347 0.0593268 0.2414994 0.1143342 -0.7341091 -1.117767 0.0453072 -0.0523033 -0.3284445 -0.602941 0.0713941 0.0242361 0.0880257 -0.2615528 -0.2968278 0.1437829 -0.0532952 0.1469593 -0.4419734 0.1031179 -0.067154 0.0933393 -0.241461 -1.6401603 0.0852635 -0.083575 0.1493391 -0.4060315 0.2054322 -0.3963024 0.2382629 -0.7046563 -1.1065806 0.4407885 -0.186792 0.627352 -1.0054929 0.3007358 -0.1450492 0.253225 -0.4097061 -0.581141 0.1557422 -0.0817379 -0.0102189 -0.3578016 0.0377203 -0.0226241 0.0448574 -0.2760422 -0.1680306 -0.45832 0.1562152 -0.3092038 -0.4718961 0.1379652 0.0802528 0.1343472 -0.0374754 0.8737124 -0.2001167 0.1321259 -0.0509953 0.3064288 -0.0766726 0.0972328 -0.094402 0.1019003 1.8859881 -0.0962783 0.1416996 -0.3690445 1.0902373 -0.3966613 0.2058999 -0.3695923 0.3813648 1.3919572 -0.1824124 0.1383432 -0.1571956 1.6121043 -0.4551783 0.1520678 -0.4660037 0.4044648 0.0378228 -0.1564692 0.0681299 -0.1465155 0.4733715 -0.2139618 0.0678862 -0.2112628 0.0111764 1.0125631 0.1416832 -0.0345493 0.579389 0.5298491 -0.1417719 -0.2094603 -0.1155736 0.7798931 0.1557703 -0.0142564 -0.0146052 0.0173032 0.2515492 0.0457586 -0.0313003 0.065779 0.3139206 0.270216 -0.0601954 0.0136317 -0.0274331 0.2353301 0.0425136 0.0021194 0.0396085 0.3424471 0.1120052 -0.0569012 -0.0026157 -0.1062522 0.0949274 -0.0009164 0.1520638 -0.0855962 0.3681382 0.0116079 0.0064139 -0.0173427 0.000895 0.1240436 0.0265809 -0.014328 0.0286846 0.1837074 -0.0906313 0.0614942 -0.0569852 0.1064826 0.0230035 0.0770866 -0.0225914 0.0292012 0.0528217 0.0525223 0.0299636 0.0756528 -0.0821928 -0.0384689 -0.1011838 0.0501291 -0.0699203 -0.1031378 0.4449693 0.1566904 -0.0517652 0.1479403 0.2881263 0.0056955 -0.1130093 -0.0111551 0.3087646 unknown
polarizability: 152.0890447|0.7800473|107.4804772|5.8595425|-22.122439|58.7812484 unknown
InChI: InChI=1S/C6H7N5O2/c12-2-9-6-10-4-3(5(13)11-6)7-1-8-4/h1,7,9-10,12H,2H2
charge 0 multiplicity 1
20 atoms
O  -0.398794 2.469378 -0.956366
O  3.725146 0.415932 -1.064234
N  0.122708 -1.408733 0.481229
N  -2.728365 0.463483 -0.450861
N  2.460299 -0.98022 0.500017
N  1.030805 0.713645 -0.262377
N  -2.358668 -1.63885 0.34835
C  -1.344089 0.348637 -0.290187
C  -1.161222 -0.953883 0.197495
C  1.18096 -0.527029 0.221625
C  -0.247897 1.284814 -0.531043
C  -3.294241 -0.739502 -0.057663
C  3.586431 -0.036415 0.301067
H  0.258685 -2.315799 0.930818
H  -3.201743 1.298559 -0.796536
H  2.652096 -1.982956 0.459772
H  -4.363564 -0.931894 -0.076992
H  4.516588 -0.56552 0.557327
H  3.420639 0.81527 0.987651
H  2.907926 0.968382 -1.238691
