program: Gaussian 09
title: 000151393
version: EM64L-G09RevD.01
frameworkgroup: C1[X(C13H12N2O2)]
method: RPBEPBE
basis: SDD
operation: Freq
keyword: #p
keyword: freq=noraman
keyword: PBEPBE/SDD
title: #p freq=noraman PBEPBE/SDD
converged: YES YES NO NO
title: Mulliken charges:
elementType: O O N N C C C C C C C C C C C C C H H H H H H H H H H H H
charge: -0.451151 -0.268444 -0.426924 0.004221 -0.478448 0.486020 0.398338 -0.353636 -0.413491 0.255825 -0.369751 -0.309221 -0.317487 -0.496315 -0.178138 -0.326625 0.100356 0.229509 0.229085 0.306260 0.238578 0.221816 0.267021 0.271161 0.265253 0.254054 0.235982 0.247301 0.378851
chargesum: 0.00000
title: Mulliken charges with hydrogens summed into heavy atoms:
elementType: O O N N C C C C C C C C C C C C C
charge: -0.072299 -0.268444 -0.120664 0.004221 -0.019854 0.486020 0.398338 -0.115059 -0.191675 0.255825 -0.102729 -0.038060 -0.052234 -0.242262 0.057844 -0.079323 0.100356
polarizability: 2.90579744e+02 -7.44264770e+00 1.33827984e+02 1.04797345e+01 1.85401171e+00 9.36043463e+01
1716.lowfreq: -8.9445 -4.4431 -0.0009 -0.0007 -0.0004 2.7151 13.3999 26.1422 50.7433
frequency: 11.2114 25.8675 50.7398 70.6610 87.5176 125.5344 149.2896 193.0848 228.0007 278.2587 298.7385 368.0975 391.8442 413.4294 419.1838 443.0775 487.4366 499.9585 525.1385 554.9474 576.1489 601.9341 631.4417 634.7756 682.8867 718.6954 726.6188 755.5663 800.5855 810.3152 819.8617 838.8534 856.0190 924.5647 944.8519 975.3190 980.5284 984.6376 988.6208 993.2471 1011.6154 1015.4185 1027.7405 1085.4175 1114.3593 1131.6208 1151.9117 1192.2862 1198.5992 1215.5809 1232.7546 1281.5843 1309.0786 1314.2412 1321.6056 1335.1646 1361.4253 1376.4054 1417.3343 1442.9995 1460.3903 1473.7146 1489.8349 1526.5313 1558.6851 1572.8281 1588.5090 1628.5892 1641.1040 2938.7692 2991.6427 3116.9528 3120.7033 3132.8793 3140.1206 3145.7430 3166.1749 3167.9167 3175.8712 3535.4682 3555.1885
redmass: 5.2156 5.2996 5.5965 5.0825 5.7705 5.9650 4.6688 6.4768 4.1513 4.1149 3.2376 4.6418 3.2439 3.1959 3.6811 1.2525 5.1518 2.6588 3.5557 5.5645 1.2044 6.4749 7.0204 5.7945 3.5353 3.5218 2.4855 4.6304 2.3848 2.9421 1.2804 1.8379 3.3754 1.3688 1.3958 1.3715 1.6280 1.4938 4.3626 1.5106 2.8792 2.8963 3.1349 3.9107 1.5820 1.4275 1.5596 1.4179 1.1823 1.1421 2.0221 1.5402 5.1723 1.5793 2.6384 1.3602 1.5693 3.6744 2.0396 4.2124 2.2008 1.7628 1.1094 3.2411 5.5525 5.0910 5.8403 6.5539 7.9129 1.0624 1.0977 1.0914 1.0898 1.0878 1.0927 1.0875 1.0960 1.1000 1.0950 1.0641 1.0771
irintensity: 2.3365 1.4956 1.2423 2.7750 0.3392 0.2152 2.9370 0.5667 1.3201 1.5442 0.9524 6.9577 5.8236 4.5698 1.8577 155.6503 5.7432 30.5858 11.7614 29.0187 82.5142 10.2743 4.6293 12.3794 68.9773 11.3028 23.5590 20.3249 15.3944 15.0072 1.2149 70.5807 10.5857 4.0741 2.4678 2.1064 3.0490 1.7033 138.5111 2.2692 74.5326 185.9257 0.2094 9.3242 5.2725 11.2051 247.4104 9.6374 8.7169 15.7780 4.2767 25.9219 6.7275 8.4224 141.9523 14.9379 21.3575 217.2536 18.0819 12.7228 33.9203 17.7291 44.1242 212.6589 5.3633 33.4938 0.1805 744.7070 145.9220 53.8236 18.7119 22.2437 15.7728 0.0532 22.6575 5.9990 15.9656 20.8847 2.2922 51.9865 59.9500
temp: 298.150 k
press: 1.00000 atm
elementType: 8 8 7 7 6 6 6 6 6 6 6 6 6 6 6 6 6 1 1 1 1 1 1 1 1 1 1 1 1
symmnumber: 1
zpe: 589353.7 jmol-1
zpe.correction: 0.224473 hartree
zpe.thermalcorrener: 0.239220 hartree
zpe.thermalcorrenthalpy: 0.240164 hartree
zpe.thermalcorrgfe: 0.179589 hartree
zpe.sumelectzpe: -761.340808 hartree
zpe.sumelectthermal: -761.326061 hartree
zpe.sumelectthermalent: -761.325116 hartree
zpe.sumelectthermalfe: -761.385692 hartree
dipole: -3.0482 2.4456 0.5747
dipole: 3.9500
quadrupole: -117.4402 -94.7531 -100.4924
quadrupole: 1.3947 -11.8402 0.9584
quadrupole: -13.2117 9.4755 3.7362 1.3947 -11.8402 0.9584
hfenergy: -761.5652805 hartree
pointgroup: C01 [X(C13H12N2O2)]
dipole: 1.219713 -0.7873544 0.5545037 debye
polarizability: 290.4535068|-9.3857806|126.3175695|-10.4989348|-15.4895497|101.2409976 unknown
InChI: InChI=1S/C13H12N2O2/c16-13(17)11-3-5-12(6-4-11)15-9-10-2-1-7-14-8-10/h1-8,15-16H,9H2
charge 0 multiplicity 1
29 atoms
O  -5.615631 -1.133881 0.395968
O  -5.610377 1.186654 0.274705
N  0.723237 -0.316522 -0.237426
N  5.401222 0.252206 -0.933284
C  1.641699 0.817587 -0.415767
C  -0.659023 -0.199873 -0.133875
C  3.078956 0.405098 -0.141967
C  -1.315977 1.070516 -0.14696
C  -1.456193 -1.381478 0.000884
C  -3.497421 -0.029068 0.130096
C  -2.710438 1.144524 -0.01183
C  -2.847243 -1.295549 0.129951
C  3.462615 -0.152781 1.104911
C  4.088412 0.580527 -1.120688
C  4.813136 -0.501965 1.31765
C  5.745207 -0.280988 0.27549
C  -4.958336 0.109689 0.26634
H  1.350083 1.621128 0.290544
H  1.564383 1.246976 -1.438287
H  1.118546 -1.250662 -0.351136
H  -0.740803 1.992166 -0.274782
H  -0.965212 -2.362674 0.007832
H  -3.219817 2.114147 -0.020461
H  -3.450493 -2.201723 0.234168
H  2.713344 -0.304519 1.890356
H  3.840238 1.00343 -2.102607
H  5.144048 -0.93093 2.268589
H  6.803374 -0.536206 0.401916
H  -6.590337 -0.957828 0.481969
