program: Gaussian 09
title: 000151299
version: EM64L-G09RevD.01
frameworkgroup: C1[X(C12H11N3O3)]
method: RPBEPBE
basis: SDD
operation: Freq
keyword: #p
keyword: freq=noraman
keyword: PBEPBE/SDD
title: #p freq=noraman PBEPBE/SDD
converged: YES YES NO NO
title: Mulliken charges:
elementType: O O O N N N C C C C C C C C C C C C H H H H H H H H H H H
charge: -0.447024 -0.251793 -0.224771 -0.064221 -0.335213 -0.382998 0.272572 -0.055949 0.207262 0.147658 -0.401415 -0.349318 -0.325449 -0.258135 -0.228259 0.123154 0.252678 -0.760393 0.279353 0.299320 0.264549 0.228640 0.232026 0.326767 0.321636 0.215970 0.264457 0.258995 0.389901
chargesum: 0.00000
title: Mulliken charges with hydrogens summed into heavy atoms:
elementType: O O O N N N C C C C C C C C C C C C
charge: -0.057123 -0.251793 -0.224771 -0.064221 -0.008446 -0.061362 0.272572 -0.055949 0.207262 0.147658 -0.122063 -0.049998 -0.060900 -0.029495 0.003767 0.123154 0.252678 -0.020972
polarizability: 2.53344336e+02 -2.11012322e+01 1.77728200e+02 2.00953384e+01 -5.87213144e-01 8.78910810e+01
1716.lowfreq: -8.0087 -3.3766 -0.0006 0.0003 0.0006 3.4081 29.0422 30.0421 33.6424
frequency: 29.0327 29.9390 33.6271 66.6152 82.9653 86.4257 126.7530 177.8135 190.0489 223.6739 262.1098 293.3826 316.2158 340.0760 367.5793 410.1210 442.7597 458.3722 481.0899 498.4539 525.9239 545.1849 575.5860 583.5462 602.4546 621.6124 632.2500 659.7926 678.7255 696.1383 733.9827 769.2999 781.2028 789.2136 841.4705 886.7823 905.2455 931.2527 934.2340 976.9695 977.7884 987.7807 1000.5735 1030.0843 1039.7395 1074.3518 1124.6071 1163.9654 1173.7027 1191.7839 1247.9450 1259.3771 1295.4962 1311.7897 1336.7602 1378.0916 1387.2346 1390.2563 1410.3163 1441.5081 1446.9547 1451.1369 1468.5077 1483.8549 1515.3279 1553.3434 1590.6026 1619.9908 1622.9652 1646.8787 2999.2262 3100.0432 3105.0210 3133.5067 3151.5945 3171.5983 3179.9100 3204.1414 3501.3931 3507.6727 3519.1873
redmass: 8.9355 5.3831 6.3386 3.1404 1.3447 3.2511 6.2595 5.6816 4.4245 5.4059 5.1249 4.8313 4.0256 7.0609 7.7369 3.4521 4.1349 3.9377 1.7008 2.8793 2.5008 3.3294 5.9022 3.2672 5.3035 1.6750 1.4185 4.6638 3.9236 4.5310 4.4601 4.7705 1.6363 2.8888 6.5555 1.5485 3.9477 1.5227 6.8601 1.3604 2.1136 4.0992 1.3198 2.0854 1.6496 2.6815 1.8173 1.5789 1.6002 1.6851 1.8340 2.4606 2.0501 2.6437 4.0164 4.5237 1.2349 4.0187 2.6801 2.1799 1.2557 1.1935 1.1016 2.7031 3.5502 5.8538 7.5084 6.3329 8.2910 7.4173 1.0360 1.0999 1.0990 1.0865 1.0920 1.0981 1.0915 1.0935 1.0772 1.0637 1.0788
irintensity: 1.1446 2.0226 2.6218 12.0658 0.2819 0.1910 1.0126 2.5271 1.0684 2.6090 7.4627 0.4592 7.1006 3.7065 2.6966 4.6715 9.3573 16.7208 20.7036 8.0689 70.9340 24.6789 21.8349 150.8076 43.2768 77.8665 129.6253 2.3165 7.6658 3.1802 5.4762 7.2681 90.8184 22.0768 5.4253 0.0331 6.9585 16.2903 24.2655 3.6553 18.0784 1.4485 0.3038 12.5032 15.8365 237.7933 46.0166 22.5303 13.1695 48.4267 58.1279 95.8938 14.5817 16.5157 4.4733 73.5245 58.6343 60.0059 132.1549 15.1293 90.7361 48.3737 16.3581 44.3390 31.5258 95.6608 356.4197 25.8680 137.5890 147.2104 9.3936 15.6434 8.5441 7.0170 19.6669 18.4237 1.1968 10.9686 38.4271 42.2985 29.5470
temp: 298.150 k
press: 1.00000 atm
elementType: 8 8 8 7 7 7 6 6 6 6 6 6 6 6 6 6 6 6 1 1 1 1 1 1 1 1 1 1 1
symmnumber: 1
zpe: 566933.8 jmol-1
zpe.correction: 0.215934 hartree
zpe.thermalcorrener: 0.232055 hartree
zpe.thermalcorrenthalpy: 0.232999 hartree
zpe.thermalcorrgfe: 0.170127 hartree
zpe.sumelectzpe: -852.532398 hartree
zpe.sumelectthermal: -852.516276 hartree
zpe.sumelectthermalent: -852.515332 hartree
zpe.sumelectthermalfe: -852.578204 hartree
dipole: -0.7416 1.4736 -2.5197
dipole: 3.0117
quadrupole: -77.0061 -98.5657 -110.0553
quadrupole: 1.3045 12.8948 4.4348
quadrupole: 18.2029 -3.3566 -14.8463 1.3045 12.8948 4.4348
hfenergy: -852.7483314 hartree
pointgroup: C01 [X(C12H11N3O3)]
dipole: -0.2418236 0.6548916 -0.9574127 debye
polarizability: 250.728935|-24.161255|178.2677273|24.9734414|4.5306845|89.9669546 unknown
InChI: InChI=1S/C12H11N3O3/c1-7(16)14-15-11-6-9(12(17)18)8-4-2-3-5-10(8)13-11/h2-6,14-15,17H,1H3
charge 0 multiplicity 1
29 atoms
O  2.040104 3.046812 0.57668
O  -0.155834 3.402204 -0.022481
O  -3.630437 -0.820497 1.398475
N  0.069747 -1.660923 -0.450548
N  -2.144695 -1.178204 -0.964393
N  -3.279069 -0.372194 -0.861803
C  1.728651 0.123657 0.121272
C  1.352334 -1.265461 -0.114417
C  0.667206 1.10364 -0.020594
C  -0.877512 -0.711995 -0.570509
C  -0.622061 0.68018 -0.36683
C  3.091651 0.402552 0.466184
C  2.337369 -2.29781 0.004117
C  4.030542 -0.628456 0.572964
C  3.655039 -1.987648 0.341885
C  0.782888 2.587741 0.163957
C  -3.990096 -0.233827 0.343912
C  -5.21018 0.674298 0.248693
H  -1.41868 1.420543 -0.467616
H  3.388082 1.43552 0.648846
H  2.009684 -3.325309 -0.178844
H  5.066292 -0.390214 0.838744
H  4.402646 -2.783411 0.431508
H  -2.279551 -2.190845 -0.878132
H  -3.616636 0.063884 -1.722946
H  -5.394242 1.064229 -0.767343
H  -5.073732 1.526987 0.935851
H  -6.100743 0.117899 0.586397
H  1.990834 4.037251 0.67117
