program: Gaussian 09
title: 000151289
version: EM64L-G09RevD.01
frameworkgroup: C1[X(C19H17N3O)]
method: RPBEPBE
basis: SDD
operation: Freq
keyword: #p
keyword: freq=noraman
keyword: PBEPBE/SDD
title: #p freq=noraman PBEPBE/SDD
converged: YES YES NO NO
title: Mulliken charges:
elementType: O N N N C C C C C C C C C C C C C C C C C C C H H H H H H H H H H H H H H H H H
charge: -0.282974 -0.150888 -0.182427 -0.486081 -0.239709 0.205269 0.155118 -0.434419 -0.514078 0.160409 0.159192 0.309592 0.210793 0.106384 -0.661805 -0.414665 -0.378304 -0.366043 -0.324948 -0.251912 -0.219892 -0.220846 -0.267695 0.240464 0.223407 0.269641 0.220584 0.257109 0.308414 0.253330 0.236760 0.208508 0.234776 0.236175 0.229994 0.272822 0.220823 0.221482 0.224326 0.231312
chargesum: 0.00000
title: Mulliken charges with hydrogens summed into heavy atoms:
elementType: O N N N C C C C C C C C C C C C C C C C C C C
charge: -0.282974 -0.150888 -0.182427 -0.177667 0.000755 0.205269 0.155118 0.058630 -0.036385 0.160409 0.159192 0.309592 0.210793 0.106384 0.036793 -0.179889 -0.142129 -0.136049 -0.052125 -0.031089 0.001590 0.003481 -0.036383
polarizability: 2.78199220e+02 1.01123536e+01 2.30753337e+02 5.33355510e+00 -8.45531958e+00 1.70965102e+02
1716.lowfreq: -6.7646 -0.0010 -0.0008 -0.0006 4.1779 9.5978 23.1514 52.0124 69.6083
frequency: 23.0685 51.9974 69.5957 77.0490 97.8330 128.0899 165.0731 174.6325 193.2874 225.6455 260.9265 270.7193 296.8298 298.9625 314.7626 352.9014 366.6560 391.8508 423.8062 427.3541 452.9093 480.2561 488.0084 502.5318 521.1267 529.9216 566.0551 577.5738 591.4012 605.2973 646.3470 653.9107 679.4669 716.6392 724.3643 748.3472 755.4986 759.1068 772.6602 786.5739 796.1011 841.9375 851.1914 859.0656 874.1057 915.7373 930.6380 934.8548 961.1502 966.5185 971.0714 990.0091 1009.3558 1020.1776 1031.7919 1047.2561 1086.6394 1104.1309 1110.7979 1118.3950 1131.1917 1144.5279 1159.9030 1168.4283 1174.5335 1198.5057 1219.9107 1234.2700 1239.4290 1254.6229 1266.4311 1280.1302 1295.1238 1303.9145 1315.2405 1338.1029 1360.9225 1382.3205 1385.8501 1400.5775 1408.3644 1437.6724 1444.0078 1452.4836 1460.5046 1460.6789 1463.8579 1465.2869 1481.3465 1499.1533 1507.6273 1565.6714 1572.9230 1586.3940 1589.9981 1625.0878 1630.2584 2921.3687 2929.3486 2980.4310 3007.3450 3013.4423 3031.5776 3083.4953 3106.7459 3123.6146 3129.9080 3131.4017 3145.2062 3148.0872 3158.4563 3162.7729 3171.5246 3611.8862
redmass: 5.3014 4.7693 4.8847 3.7573 3.5618 4.0440 3.6736 2.6895 1.3589 5.0838 4.3537 4.0633 3.2928 4.0292 3.9540 3.2495 5.2784 6.5545 2.9448 3.9364 5.9582 1.2099 5.3138 4.2669 4.8348 3.9326 4.6165 4.1745 4.8093 3.8598 4.9283 5.6338 4.4275 3.4054 4.6045 1.3571 2.8375 2.4257 2.1915 4.5986 4.5914 2.9612 1.6628 1.4993 3.1529 3.6404 1.3950 3.7230 1.4006 3.0761 1.3033 1.3343 2.2389 3.3383 2.3737 1.9417 2.6840 2.3604 1.3736 1.8646 1.8851 2.6100 1.6877 1.1846 1.1234 1.3563 1.5163 1.9747 2.0585 2.6123 1.4696 1.6631 2.0840 2.3210 1.4532 1.4016 1.9555 2.2543 2.7811 2.8665 4.5683 2.7335 1.3364 1.2250 1.7558 2.9533 1.2935 1.3072 2.9802 1.7480 1.4254 7.8877 7.1405 6.2832 7.7662 6.9139 7.2347 1.0500 1.0822 1.0595 1.0717 1.0862 1.0952 1.0980 1.0994 1.0849 1.0859 1.0890 1.0952 1.0889 1.0939 1.1001 1.1001 1.0801
irintensity: 0.2353 2.0757 0.5854 0.2093 3.0520 2.3415 2.5491 2.3591 0.0911 1.2651 2.8934 1.3864 1.4196 5.2506 0.8587 4.4880 7.0280 8.0712 9.7456 2.3271 1.1278 79.5639 9.0315 5.4760 2.9935 4.9662 1.5490 2.0737 1.8830 3.8531 0.6183 0.6675 14.9346 9.3014 10.1631 92.7675 38.7539 52.7328 13.9252 0.3359 0.1739 5.6787 0.9402 1.0808 10.4895 7.9003 2.8543 11.7408 1.2250 6.1959 0.0185 0.6803 3.9945 7.8752 18.0972 10.0736 8.3738 8.2628 8.7255 9.3618 11.9420 15.3265 37.2932 8.0400 6.6778 15.5067 21.6414 22.3279 51.4843 57.7120 16.2425 41.8402 10.2166 133.4981 54.1196 22.0221 10.5289 74.1017 44.8677 63.9108 5.2609 18.3558 61.3075 30.7112 57.7976 15.0087 7.8338 39.7429 1.8648 24.4415 141.7255 70.3539 12.3071 0.9385 129.7779 208.9749 3.0327 80.5161 51.7351 31.7361 24.6997 44.0763 44.5287 18.0333 4.7631 0.9626 6.3200 3.7998 32.4004 7.4056 17.7767 34.5863 24.3368 42.0952
temp: 298.150 k
press: 1.00000 atm
elementType: 8 7 7 7 6 6 6 6 6 6 6 6 6 6 6 6 6 6 6 6 6 6 6 1 1 1 1 1 1 1 1 1 1 1 1 1 1 1 1 1
symmnumber: 1
zpe: 839490.3 jmol-1
zpe.correction: 0.319745 hartree
zpe.thermalcorrener: 0.337696 hartree
zpe.thermalcorrenthalpy: 0.338640 hartree
zpe.thermalcorrgfe: 0.273809 hartree
zpe.sumelectzpe: -972.123242 hartree
zpe.sumelectthermal: -972.105292 hartree
zpe.sumelectthermalent: -972.104347 hartree
zpe.sumelectthermalfe: -972.169178 hartree
dipole: 0.9369 -4.4029 3.5988
dipole: 5.7632
quadrupole: -136.8711 -125.3674 -128.6297
quadrupole: 12.4157 -2.3753 -0.8967
quadrupole: -6.5817 4.9220 1.6597 12.4157 -2.3753 -0.8967
hfenergy: -972.4429872 hartree
pointgroup: C01 [X(C19H17N3O1)]
dipole: 0.4326009 -1.6934977 1.4443436 debye
polarizability: 277.9579446|10.9466834|230.7759788|3.0384034|-9.8794308|171.1837354 unknown
InChI: InChI=1S/C19H17N3O/c1-21-16-9-5-3-7-14(16)19(23)22-11-10-13-12-6-2-4-8-15(12)20-17(13)18(21)22/h2-9,18,20H,10-11H2,1H3
charge 0 multiplicity 1
40 atoms
O  -2.053908 2.682818 -0.791246
N  -0.988637 1.558518 0.949021
N  -1.478592 -0.803963 1.398394
N  1.495981 -1.230844 0.666799
C  -0.477976 0.270508 1.487461
C  0.85061 0.009972 0.784274
C  1.646993 1.013907 0.233141
C  -0.025014 2.676717 1.112502
C  1.22535 2.466434 0.20569
C  2.842076 0.368451 -0.275523
C  -1.861194 1.600178 -0.150202
C  -2.36938 -0.846369 0.318305
C  2.718216 -1.041516 0.004829
C  -2.561622 0.328019 -0.476855
C  -1.44028 -1.877406 2.394846
C  4.005623 0.836856 -0.941805
C  -3.124797 -2.014235 0.01265
C  3.709776 -1.974869 -0.36664
C  -3.466688 0.306731 -1.562058
C  4.999609 -0.090002 -1.311406
C  4.853043 -1.480506 -1.028038
C  -4.028476 -2.009749 -1.069501
C  -4.202434 -0.854462 -1.8699
H  -0.284114 0.428055 2.570667
H  0.27209 2.713859 2.177289
H  -0.546095 3.609232 0.847632
H  2.041668 3.128441 0.554911
H  0.979813 2.778122 -0.828166
H  1.090544 -2.130527 0.913833
H  -2.460543 -2.116542 2.749418
H  -0.846706 -1.546535 3.263943
H  -0.9915 -2.820641 2.011897
H  4.126643 1.901809 -1.169819
H  -2.998375 -2.926633 0.603156
H  3.603388 -3.044421 -0.152947
H  -3.581135 1.23158 -2.137179
H  5.901506 0.25705 -1.827677
H  5.643447 -2.1766 -1.330192
H  -4.595741 -2.920552 -1.293589
H  -4.90267 -0.862784 -2.710819
