program: Gaussian 09
title: 000151317
version: EM64L-G09RevD.01
frameworkgroup: C1[X(C16H14N4O6S)]
method: RPBEPBE
basis: SDD
operation: Freq
keyword: #p
keyword: freq=noraman
keyword: PBEPBE/SDD
title: #p freq=noraman PBEPBE/SDD
converged: YES YES NO NO
title: Mulliken charges:
elementType: S O O O O O O N N N N C C C C C C C C C C C C C C C C H H H H H H H H H H H H H H
charge: 0.873301 -0.524211 -0.524101 -0.210335 -0.210286 -0.211184 -0.211185 -0.122223 -0.122207 0.016281 0.016252 -0.435355 -0.386336 -0.435373 -0.386374 0.306835 0.306832 0.248448 0.248423 -0.077421 -0.077344 -0.340270 -0.340339 -0.368716 -0.368891 -0.230127 -0.229940 0.253086 0.249241 0.253308 0.269503 0.253083 0.249237 0.253326 0.269524 0.256086 0.256096 0.327464 0.327595 0.289207 0.289090
chargesum: 0.00000
title: Mulliken charges with hydrogens summed into heavy atoms:
elementType: S O O O O O O N N N N C C C C C C C C C C C C C C C C
charge: 0.873301 -0.524211 -0.524101 -0.210335 -0.210286 -0.211184 -0.211185 -0.122223 -0.122207 0.016281 0.016252 0.066972 0.136475 0.066948 0.136475 0.306835 0.306832 0.248448 0.248423 -0.077421 -0.077344 -0.084184 -0.084243 -0.041252 -0.041296 0.059080 0.059150
polarizability: 3.71776626e+02 -1.44098516e+01 2.81033443e+02 -4.05752362e-02 1.82939513e-01 1.89816801e+02
1716.lowfreq: -2.6532 -0.0003 0.0013 0.0016 3.0740 5.7000 16.3312 19.3464 19.5368
frequency: 16.3311 19.2597 19.5238 38.7850 39.0602 60.1104 76.4998 89.3790 109.3328 129.8026 137.1147 157.0858 158.9837 167.7492 176.8846 178.7190 201.9754 214.0671 215.3562 217.3624 233.2899 295.1267 318.4038 323.2453 328.3040 373.5215 389.0243 399.6957 408.7878 411.2869 437.0998 438.6250 456.5494 528.7171 532.1707 554.6654 555.7965 585.0723 601.3158 647.4822 649.2035 679.0620 681.0188 703.4110 707.9329 739.2298 739.7155 777.9978 800.7864 801.0996 810.6601 813.6547 836.7851 837.8887 893.2827 894.4195 925.1354 931.9151 934.4842 944.4504 948.3461 977.6572 980.3044 1000.9072 1001.0658 1053.6797 1056.6876 1071.7508 1075.3772 1096.3653 1096.5816 1117.9771 1118.5262 1123.8666 1124.0019 1135.1695 1135.4018 1142.7665 1143.1411 1162.1749 1162.4579 1196.5199 1196.7397 1242.0352 1242.0978 1340.9106 1342.3419 1368.2371 1370.5434 1391.6604 1391.9424 1427.5996 1428.0160 1459.7792 1459.8045 1475.9393 1476.1413 1514.9077 1517.8904 1563.7189 1568.5749 1606.0208 1607.0106 3066.8224 3066.8762 3091.5553 3091.6599 3149.5864 3149.6056 3165.0159 3165.8727 3167.9509 3168.9542 3177.6525 3177.6697 3207.2759 3207.3185
redmass: 8.9929 7.3297 6.1743 10.5997 10.3498 4.7693 4.1908 11.0878 7.8699 3.0684 2.8938 4.0425 4.1261 3.9453 5.4914 5.2936 5.5852 8.6541 9.2754 10.0648 9.1099 6.4815 6.8624 8.5984 9.1625 7.2327 6.6019 7.5288 7.7219 9.3300 3.8745 4.1686 9.9821 5.4795 4.4751 4.4813 3.9346 5.8005 6.3522 7.6113 7.4639 7.0801 7.2687 8.0943 8.7371 4.9069 4.7824 15.4558 1.0542 1.0442 6.9083 6.5638 1.4685 1.5194 4.2968 4.2896 12.0973 7.1548 7.7528 1.4601 1.4271 1.3399 1.3328 1.0846 1.0875 2.4248 2.6419 3.9041 3.3888 1.3229 1.3220 1.4101 1.4159 1.3208 1.3213 1.4577 1.4482 2.2029 2.2753 1.5352 1.5721 9.2499 9.6351 1.4017 1.3661 5.9572 6.1073 5.4690 5.1999 3.5538 3.7664 3.3308 3.1940 1.0793 1.0792 1.2180 1.2202 6.1698 6.0133 9.3717 9.3095 7.0033 7.0834 1.0533 1.0533 1.0578 1.0578 1.0877 1.0877 1.0924 1.0914 1.0974 1.0965 1.1167 1.1167 1.1170 1.1170
irintensity: 2.8901 3.8025 2.7844 0.3923 0.2213 4.8503 2.5923 2.3511 1.5490 1.0872 0.0730 2.9857 11.6279 3.1118 0.8281 3.6370 14.0195 11.1145 6.0998 0.1369 6.6169 0.3252 36.2854 0.4659 5.3893 6.9126 6.4693 0.0321 39.2565 6.6603 3.7678 1.5867 126.8843 1.3259 2.2372 122.3300 25.9811 2.7065 70.9790 6.7717 12.1181 2.4484 0.0204 0.1679 2.9637 0.1768 9.2868 72.1859 35.9493 37.0740 23.2018 43.4267 15.8016 29.4445 44.6621 5.1406 36.0094 0.0792 19.3741 3.6899 14.3923 0.3176 1.2526 0.5259 1.8075 90.4744 5.4824 70.3536 18.0062 12.2863 0.5136 71.6702 25.3125 2.8296 2.7628 0.0003 0.0195 9.2596 49.1872 26.4469 0.6356 642.8406 22.0913 29.1850 3.9627 33.2193 71.7193 24.5717 58.9235 19.7905 1.2162 0.3367 0.0298 5.0054 5.8038 0.0804 1.8822 625.7630 95.7061 12.6694 164.8816 346.2574 86.4825 44.1929 11.7236 45.2924 13.5116 2.8077 0.6867 0.2012 22.2561 16.6524 7.9833 3.9298 7.0382 9.1080 12.7465
temp: 298.150 k
press: 1.00000 atm
elementType: 16 8 8 8 8 8 8 7 7 7 7 6 6 6 6 6 6 6 6 6 6 6 6 6 6 6 6 1 1 1 1 1 1 1 1 1 1 1 1 1 1
symmnumber: 1
zpe: 749521.1 jmol-1
zpe.correction: 0.285478 hartree
zpe.thermalcorrener: 0.310478 hartree
zpe.thermalcorrenthalpy: 0.311422 hartree
zpe.thermalcorrgfe: 0.227305 hartree
zpe.sumelectzpe: -1684.128158 hartree
zpe.sumelectthermal: -1684.103157 hartree
zpe.sumelectthermalent: -1684.102213 hartree
zpe.sumelectthermalfe: -1684.186331 hartree
dipole: 0.0080 0.0149 -4.0506
dipole: 4.0507
quadrupole: -116.5265 -171.8104 -185.6594
quadrupole: -55.2829 -0.1522 0.0537
quadrupole: 41.4722 -13.8116 -27.6606 -55.2829 -0.1522 0.0537
hfenergy: -1684.4136357 hartree
pointgroup: C01 [X(C16H14N4O6S1)]
dipole: -0.0041829 0.0009157 -1.5936519 debye
polarizability: 369.2513387|-20.7462501|283.5585964|-0.1298399|0.2079613|189.8169352 unknown
InChI: InChI=1S/C16H14N4O6S/c21-19(22)15-9-11(1-3-13(15)17-5-6-17)27(25,26)12-2-4-14(18-7-8-18)16(10-12)20(23)24/h1-4,9-10H,5-8H2
charge 0 multiplicity 1
41 atoms
S  0.000725 -0.000809 2.14552
O  0.329978 1.407711 2.912684
O  -0.327221 -1.410039 2.912011
O  -3.839661 -2.750696 -0.202158
O  3.843123 2.750463 -0.197715
O  -5.133368 -1.409346 -1.512025
O  5.131799 1.411191 -1.514748
N  -4.783197 1.305661 -1.391059
N  4.778869 -1.303084 -1.400512
N  -4.174583 -1.585801 -0.658244
N  4.175174 1.586522 -0.658312
C  -5.637182 2.512189 -1.33669
C  -6.236507 1.092854 -1.354015
C  5.63227 -2.510198 -1.350197
C  6.232346 -1.091157 -1.36495
C  -3.731997 0.937589 -0.576439
C  3.72903 -0.93632 -0.583574
C  -3.402903 -0.416862 -0.204456
C  3.402056 0.417438 -0.207344
C  -1.464414 0.35972 1.011785
C  1.464025 -0.360151 1.00885
C  -2.853417 1.9767 -0.114282
C  2.849716 -1.975694 -0.12337
C  -2.275711 -0.694991 0.60814
C  2.276145 0.694695 0.607311
C  -1.731737 1.703993 0.672226
C  1.729285 -1.70382 0.665215
H  -5.672372 3.117646 -2.248211
H  -5.675143 3.074195 -0.393912
H  -6.67373 0.714538 -0.422843
H  -6.683252 0.698282 -2.26998
H  5.665835 -3.113465 -2.263227
H  5.671272 -3.074514 -0.408836
H  6.671021 -0.715261 -0.433468
H  6.677996 -0.694584 -2.280587
H  -3.087486 3.00807 -0.395876
H  3.082116 -3.006552 -0.408194
H  -2.08111 -1.727978 0.913138
H  2.083062 1.727043 0.915456
H  -1.086568 2.504105 1.050171
H  1.083717 -2.504284 1.041718
