program: Gaussian 09
title: 000014264
version: EM64L-G09RevD.01
frameworkgroup: C1[X(C3H6O3S)]
method: RPBEPBE
basis: SDD
operation: Freq
keyword: #pfreq=noraman
keyword: PBEPBE/SDD
title: #p freq=noraman PBEPBE/SDD
converged: YES YES NO NO
title: Mulliken charges:
elementType: S O O O C C C H H H H H H
charge: 1.056738 -0.342668 -0.500442 -0.505844 -0.590304 -0.403252 -0.286593 0.291243 0.302981 0.245621 0.260783 0.252293 0.219446
chargesum: 0.00000
title: Mulliken charges with hydrogens summed into heavy atoms:
elementType: S O O O C C C
charge: 1.056738 -0.342668 -0.500442 -0.505844 0.003919 0.103152 0.185145
polarizability: 8.01507009e+01 -1.35425137e+00 5.75692150e+01 1.38549902e-01 -1.78263883e+00 6.14158314e+01
1716.lowfreq: -12.2750 -10.0089 -7.8400 -0.0027 -0.0021 0.0021 55.3108 168.6964 255.9068
frequency: 54.8235 168.6906 255.8982 264.6427 276.9320 282.4737 444.5711 455.9219 485.4426 571.4770 825.0583 846.4006 856.7525 901.0438 934.2358 957.3959 1023.0779 1057.6855 1122.1733 1151.6077 1203.1220 1240.1094 1323.7000 1337.7147 1417.0741 1444.3014 1458.1637 2983.1632 3020.5655 3063.3404 3075.9215 3094.9363 3167.3451
redmass: 3.6332 4.7180 2.5100 6.0020 4.7995 6.9276 12.2272 4.8893 6.6773 2.5284 1.9198 2.4391 9.3265 2.0434 2.3490 3.3942 2.4826 1.6871 1.3189 1.3527 1.3468 1.2441 1.2549 1.2234 1.1000 1.0979 1.0861 1.0626 1.0605 1.0583 1.1007 1.1036 1.1126
irintensity: 0.2085 0.3897 4.5553 6.4022 8.8056 8.7998 54.7510 27.2288 2.5790 39.9649 12.6762 25.6481 70.1262 15.6460 22.0756 74.1778 21.5010 6.9742 3.8689 8.4725 3.3037 9.7007 19.3287 3.4197 11.1548 11.2286 1.9147 51.7569 12.9010 1.9700 3.2568 16.2003 0.4729
temp: 298.150 k
press: 1.00000 atm
elementType: 16 8 8 8 6 6 6 1 1 1 1 1 1
symmnumber: 1
zpe: 243833.4 jmol-1
zpe.correction: 0.092871 hartree
zpe.thermalcorrener: 0.100437 hartree
zpe.thermalcorrenthalpy: 0.101381 hartree
zpe.thermalcorrgfe: 0.060642 hartree
zpe.sumelectzpe: -740.900048 hartree
zpe.sumelectthermal: -740.892482 hartree
zpe.sumelectthermalent: -740.891538 hartree
zpe.sumelectthermalfe: -740.932277 hartree
dipole: 6.0671 3.0848 1.4788
dipole: 6.9651
quadrupole: -49.2218 -48.2384 -53.8149
quadrupole: -0.3587 0.4799 1.7344
quadrupole: 1.2032 2.1867 -3.3899 -0.3587 0.4799 1.7344
hfenergy: -740.9929191 hartree
pointgroup: C01[X(C3H6O3S1)]
dipole: 2.398886 -1.1179402 -0.7104263 debye
dipolederiv: 1.6232276 0.0325272 -0.0221726 0.1946875 1.2264506 -0.0609948 0.0807308 -0.0505847 1.2213207 -0.7821131 -0.1410509 0.031329 -0.0986215 -0.5611435 -0.0290117 0.0466555 0.0193635 -0.3939578 -0.6113113 0.0127575 0.0653788 -0.0703055 -0.4802344 0.0849449 0.1812778 0.0591201 -0.5679482 -0.6360924 0.0408015 -0.0338107 0.0840721 -0.4750795 0.0353455 -0.1889725 0.0559064 -0.5914455 0.0772952 -0.0077769 -0.0164086 -0.0210088 -0.0994764 -0.0218939 -0.0656364 -0.0056177 -0.0322315 -0.0809341 -0.0048885 -0.0171753 0.0241669 -0.1507284 -0.0362748 0.1596098 -0.0510046 0.086276 0.4177456 0.0734378 -0.0813077 -0.1532654 0.2103576 -0.032927 -0.3469218 -0.1763493 0.3080411 0.0213558 0.050957 0.013536 0.035155 0.067738 0.0150767 -0.0220002 0.0047518 -0.0301155 0.0472543 -0.0133399 0.021349 -0.0297982 -0.0036481 0.003934 0.0358621 0.0081721 0.0886145 -0.0721628 0.0739842 0.07544 0.0507161 0.1199628 -0.0250419 0.0493669 -0.0240482 0.0663992 0.085223 -0.0278447 0.0025876 -0.0101461 0.0357937 0.0457909 -0.0515414 0.072201 -0.0643566 -0.0757003 -0.082956 -0.0585586 -0.03087 0.0876561 -0.0300901 -0.0088123 -0.0274028 0.0474752 -0.0137875 -0.0066083 0.019813 0.0252181 0.0223513 0.0511422 0.1303816 0.1154923 -0.1380716 unknown
polarizability: 80.1105391|1.6455957|58.0004907|-0.0598928|-2.1355348|61.0247175 unknown
InChI: InChI=1S/C3H6O3S/c4-7(5)3-1-2-6-7/h1-3H2
charge 0 multiplicity 1
13 atoms
S  -0.95201 -0.023714 0.010359
O  0.360867 1.241534 0.628229
O  -1.710896 -0.59378 1.313833
O  -1.788377 0.584914 -1.230094
C  0.458876 -1.243801 -0.644396
C  1.727975 -0.714863 0.013518
C  1.645174 0.838698 0.031872
H  0.4142 -1.104192 -1.735071
H  0.124812 -2.240874 -0.326166
H  2.619562 -1.032957 -0.556921
H  1.813076 -1.092664 1.046466
H  2.418282 1.264967 0.693542
H  1.750259 1.257533 -0.989071
