program: Gaussian 09
title: 000151237
version: EM64L-G09RevD.01
frameworkgroup: C1[X(C5H8O)]
method: RPBEPBE
basis: SDD
operation: Freq
keyword: #p
keyword: freq=noraman
keyword: PBEPBE/SDD
title: #p freq=noraman PBEPBE/SDD
converged: YES YES NO NO
title: Mulliken charges:
elementType: O C C C C C H H H H H H H H
charge: -0.435296 -0.395077 -0.178810 -0.189474 -0.074457 -0.574432 0.220148 0.196569 0.219045 0.227616 0.215837 0.334149 0.217130 0.217054
chargesum: 0.00000
title: Mulliken charges with hydrogens summed into heavy atoms:
elementType: O C C C C C
charge: -0.101147 0.021640 0.040235 0.038142 0.141379 -0.140248
polarizability: 1.10599293e+02 1.00283953e+01 5.14499166e+01 7.35612680e+00 2.28055736e+00 3.36918230e+01
1716.lowfreq: -26.2809 -5.2268 -0.0011 -0.0011 0.0003 6.3081 62.4575 149.7899 179.3920
frequency: 62.2922 149.7545 179.3906 196.6306 255.0194 388.3933 435.0010 506.3514 653.4661 853.4189 901.6130 929.1681 937.9602 962.0880 977.8373 1018.0592 1067.3597 1138.0418 1209.2533 1268.6497 1281.8095 1289.0478 1315.2131 1370.7365 1431.3496 1464.3935 1615.3558 1666.2735 2952.2180 3070.0957 3084.4467 3089.5609 3096.6236 3102.1600 3205.8670 3555.7942
redmass: 3.0761 2.5575 2.2487 2.1649 1.2965 3.3085 2.3094 2.6948 1.5025 1.8664 2.4233 2.0996 1.3186 1.2809 1.4998 1.1067 2.2257 1.5039 1.6898 1.2592 1.3905 1.2327 1.2734 1.1852 1.2496 1.0972 4.1797 5.6799 1.0687 1.0901 1.0850 1.0897 1.0753 1.0875 1.1145 1.0664
irintensity: 1.8117 1.1261 15.8625 24.6046 158.7543 7.5262 5.3491 11.1513 4.7751 4.5566 74.3261 68.2047 12.8082 66.0950 0.2086 71.0527 6.2489 61.4483 5.2054 0.3099 5.8312 2.3602 5.0216 31.6456 2.9713 6.3904 18.4296 0.1238 80.1500 1.7068 6.6849 5.9516 41.1139 26.2164 23.7047 10.8572
temp: 298.150 k
press: 1.00000 atm
elementType: 8 6 6 6 6 6 1 1 1 1 1 1 1 1
symmnumber: 1
zpe: 303137.9 jmol-1
zpe.correction: 0.115459 hartree
zpe.thermalcorrener: 0.122803 hartree
zpe.thermalcorrenthalpy: 0.123747 hartree
zpe.thermalcorrgfe: 0.084083 hartree
zpe.sumelectzpe: -270.024473 hartree
zpe.sumelectthermal: -270.017129 hartree
zpe.sumelectthermalent: -270.016185 hartree
zpe.sumelectthermalfe: -270.055849 hartree
dipole: -0.9831 1.3446 1.2042
dipole: 2.0554
quadrupole: -38.7498 -31.4406 -40.9704
quadrupole: 4.5779 4.0102 -0.7824
quadrupole: -1.6962 5.6130 -3.9168 4.5779 4.0102 -0.7824
hfenergy: -270.1399322 hartree
pointgroup: C01 [X(C5H8O1)]
dipole: 0.3936983 0.1910954 0.6799899 debye
dipolederiv: -1.0360232 -0.06223 0.0442501 -0.1762194 -0.6345736 -0.1073341 -0.0996944 -0.0767829 -0.1210212 0.7276621 0.1097022 -0.0527681 0.0461856 0.5819247 0.0912712 0.1354343 0.0360463 0.2083236 -0.2035743 -0.0558907 0.0074542 0.0735244 -0.3145061 -0.1578848 -0.0242101 -0.1435054 0.105673 0.0561202 -0.0265387 -0.0397258 -0.0766264 -0.0855941 -0.0483066 0.0092717 -0.076456 0.0800077 0.1723425 -0.0281729 -0.0338223 -0.0743091 -0.0785576 -0.0759799 0.1097317 -0.0846817 0.1020868 -0.2433043 -0.0636498 0.0703742 -0.0421165 -0.3579253 -0.1744877 0.0209892 -0.1710344 0.0348107 0.0533751 -0.0498298 0.0358703 -0.0122169 0.0273961 0.0551 -0.0197202 0.1087382 -0.0866438 -0.1259503 0.0729732 0.0663665 0.0329908 -0.1085732 -0.0981817 0.0472899 -0.1601882 -0.0221562 0.0456009 0.0265847 -0.0069443 0.07588 0.1320913 0.1067124 -0.0047417 0.1050887 -0.105654 0.0419656 0.0202182 0.0039326 0.0362314 0.1252938 0.0854952 -0.03955 0.0915688 -0.0834477 0.0462546 0.0026475 0.0441771 0.0368759 0.1261133 0.0859004 -0.0441341 0.0976989 -0.0993299 0.4523916 -0.0337047 -0.0614015 -0.0000245 0.2660724 0.0776659 -0.0345051 0.1169641 0.0105286 -0.0701392 0.0603645 -0.0547808 0.0616331 0.1600681 0.0557378 -0.0645379 0.0575523 0.0581392 0.0832788 0.0275264 -0.0229822 0.0181917 0.1607703 0.104292 0.0083766 0.0989912 -0.081317 unknown
polarizability: 110.3575259|-2.6802339|35.3450226|-12.7893327|-5.5134216|50.0384846 unknown
InChI: InChI=1S/C5H8O/c1-2-3-4-5-6/h2-4,6H,1,5H2
charge 0 multiplicity 1
14 atoms
O  -2.868768 -0.583563 -0.268302
C  -1.962744 0.575305 -0.06014
C  -0.621548 0.173924 0.499354
C  0.554461 0.219892 -0.195814
C  1.849855 -0.181994 0.3548
C  3.028575 -0.127098 -0.330977
H  -1.855263 1.016344 -1.06425
H  -2.458101 1.317823 0.602136
H  -0.612867 -0.193611 1.538583
H  0.546763 0.583268 -1.234602
H  1.849615 -0.550256 1.391838
H  -2.977106 -1.062694 0.592979
H  3.9740 -0.44155 0.12314
H  3.072829 0.233909 -1.366044
