program: Gaussian 09
title: 000151231
version: EM64L-G09RevD.01
frameworkgroup: C1[X(C15H23N3)]
method: RPBEPBE
basis: SDD
operation: Freq
keyword: #pfreq=noraman
keyword: PBEPBE/SDD
title: #p freq=noraman PBEPBE/SDD
converged: YES YES NO NO
title: Mulliken charges:
elementType: N N N C C C C C C C C C C C C C C C H H H H H H H H H H H H H H H H H H H H H H H
charge: -0.323715 -0.109766 -0.637057 -0.028037 0.463178 0.446726 -0.391190 0.524574 -0.630257 -0.627565 -0.469405 -0.551300 -0.530129 0.149246 -0.546691 -0.687610 -0.703302 -0.676131 0.218694 0.220918 0.242220 0.244793 0.213586 0.217346 0.210352 0.247374 0.202899 0.223129 0.209671 0.210346 0.218170 0.221497 0.222192 0.250774 0.218245 0.213804 0.223175 0.218180 0.221364 0.333612 0.326090
chargesum: 0.00000
title: Mulliken charges with hydrogens summed into heavy atoms:
elementType: N N N C C C C C C C C C C C C C C C
charge: -0.323715 -0.109766 0.022644 -0.028037 0.463178 0.446726 0.048422 0.524574 -0.388038 -0.382772 -0.038472 -0.093574 -0.104101 0.149246 -0.126674 -0.025751 -0.020479 -0.013412
polarizability: 2.33344212e+02 1.28578059e+00 1.79909940e+02 -3.03395232e+00 5.95615115e+00 1.39049910e+02
1716.lowfreq: -3.9682 0.0004 0.0006 0.0007 7.9596 8.4049 29.2868 40.9110 46.4647
frequency: 28.9716 40.7974 46.4147 52.4673 65.6968 71.7046 93.2972 124.7874 135.3914 141.5200 191.0646 200.2726 212.2380 216.2162 235.0031 256.5721 286.6773 295.3835 313.4038 326.2513 351.9307 362.8549 396.9399 464.5591 483.1541 515.6555 529.9105 562.1369 576.9464 640.0991 650.9584 655.1042 687.0057 723.3872 777.1339 780.8793 786.6332 796.6840 837.9838 881.1840 888.0712 897.5227 908.9750 914.1529 937.4707 966.8545 979.7035 1002.3482 1013.2485 1056.5156 1060.3896 1064.1626 1074.5225 1074.9017 1078.5087 1080.5035 1082.8726 1119.8519 1164.9238 1172.2082 1204.9479 1234.9491 1244.6593 1247.3806 1264.5851 1273.3275 1279.2951 1301.5952 1309.5756 1313.9547 1319.7420 1334.7587 1369.1325 1386.4146 1386.9693 1389.8581 1428.1406 1430.5209 1462.6643 1469.9157 1471.4430 1471.9844 1474.1810 1475.7661 1476.6268 1478.8688 1489.6721 1490.3678 1492.0156 1502.8305 1576.9618 1581.6531 1611.9040 1641.0587 2948.1275 2972.6645 2978.2674 2978.7805 2979.4838 2985.5574 2990.1042 2994.3526 3021.8238 3036.6505 3044.8255 3051.9160 3056.7466 3075.5969 3077.4839 3078.2235 3082.3863 3084.5143 3088.3073 3102.4106 3107.1587 3565.3285 3716.4008
redmass: 2.5830 3.6026 3.4146 3.8941 2.6822 2.5790 3.1868 2.1329 3.6516 3.0884 1.1880 1.4002 2.6863 1.7115 1.8493 2.1659 2.2948 2.1078 1.4539 2.0699 2.4303 3.0017 3.3855 1.1268 3.5464 3.4530 3.6943 3.8913 4.2724 3.4534 4.8652 4.1346 5.1549 3.1492 1.8442 1.2487 1.6963 1.2204 1.5764 2.8890 2.9968 1.5462 1.3728 2.8103 3.0912 2.3411 4.0596 2.3835 2.2094 2.0559 2.0488 2.0008 1.5178 1.5953 2.1703 2.2864 1.6735 2.6441 1.2334 1.4592 1.1886 1.3319 1.4061 1.2768 1.4132 1.8403 1.4354 1.5123 1.4162 1.4724 1.7496 3.1615 3.8480 1.2100 1.1990 1.2451 3.2047 2.9682 1.3659 1.4252 1.0464 1.0579 1.0581 1.0746 1.1242 1.3682 1.0989 1.0927 1.0704 1.1284 3.6460 1.6890 6.1066 4.0318 1.0647 1.0684 1.0349 1.0348 1.0348 1.0600 1.0657 1.0619 1.0941 1.1016 1.1018 1.0987 1.0957 1.0996 1.1000 1.0999 1.1012 1.1002 1.1014 1.0907 1.0914 1.0447 1.1047
irintensity: 0.0175 0.1765 0.2120 0.8107 0.3194 0.0366 0.7532 0.2975 0.7650 0.5227 0.1351 0.7126 1.4459 0.7046 4.9895 0.7142 3.0436 3.6863 76.5944 63.3552 71.7320 3.7440 8.3852 54.2705 2.3914 3.7175 1.1493 0.9991 2.1254 1.3756 12.3005 13.0795 16.3329 3.0917 1.3499 4.8314 4.9475 0.3235 1.4316 17.4127 8.6401 22.7266 0.3114 22.3921 21.5788 0.3218 2.2627 0.5270 0.4723 15.3862 14.7761 0.7851 5.2332 6.8667 9.0179 13.5085 1.0435 1.5532 4.3118 2.4365 7.1854 0.3112 0.4354 0.0509 4.3365 4.4835 80.5684 7.2439 0.4695 2.5839 16.5504 0.7865 1.0789 11.4811 18.3777 2.5215 3.8460 163.2435 23.5705 27.4657 7.8422 17.3288 4.0735 5.3074 2.0066 27.7288 18.8081 13.5515 3.8387 19.0217 35.6087 83.5530 11.0136 363.2866 59.3860 86.6842 30.7878 57.1779 28.8021 37.2840 25.1218 36.6562 45.8070 7.4257 53.3339 5.2764 0.5960 59.6003 57.3657 41.6956 36.0288 40.4444 29.6746 28.8048 17.2707 41.2459 53.9164
temp: 298.150 k
press: 1.00000 atm
elementType: 7 7 7 6 6 6 6 6 6 6 6 6 6 6 6 6 6 6 1 1 1 1 1 1 1 1 1 1 1 1 1 1 1 1 1 1 1 1 1 1 1
symmnumber: 1
zpe: 928528.3 jmol-1
zpe.correction: 0.353658 hartree
zpe.thermalcorrener: 0.373437 hartree
zpe.thermalcorrenthalpy: 0.374381 hartree
zpe.thermalcorrgfe: 0.304613 hartree
zpe.sumelectzpe: -748.278933 hartree
zpe.sumelectthermal: -748.259154 hartree
zpe.sumelectthermalent: -748.258210 hartree
zpe.sumelectthermalfe: -748.327978 hartree
dipole: -3.6607 0.4183 -0.4684
dipole: 3.7141
quadrupole: -119.1773 -105.5541 -105.0459
quadrupole: 1.2259 -7.3010 1.5777
quadrupole: -9.2515 4.3717 4.8799 1.2259 -7.3010 1.5777
hfenergy: -748.6325912 hartree
pointgroup: C01 [X(C15H23N3)]
dipole: -1.4482755 -0.108876 0.1609977 debye
polarizability: 233.0361126|-3.1620186|180.346296|5.0315924|4.7000183|138.9216538 unknown
InChI: InChI=1S/C15H23N3/c1-4-11-9-12(5-2)14(13(6-3)10-11)18-8-7-17-15(18)16/h9-10H,4-8,16H2,1-3H3
charge 0 multiplicity 1
41 atoms
N  1.596463 0.097165 0.222471
N  3.709552 -0.041543 -0.746863
N  1.818873 0.347101 -2.165208
C  0.158988 0.020798 0.23581
C  -0.511082 -1.194067 -0.108379
C  -0.591996 1.178007 0.611233
C  2.457753 -0.317888 1.361698
C  -2.693086 -0.0842 0.268044
C  -1.928302 -1.21626 -0.096218
C  -2.003727 1.100572 0.627389
C  3.893003 -0.164137 0.7364
C  0.248615 -2.470971 -0.451242
C  0.100984 2.488846 0.953541
C  2.410869 0.123177 -0.935875
C  -4.214742 -0.12137 0.240622
C  0.174548 -3.528354 0.683875
C  0.366014 3.363577 -0.302223
C  -4.797672 0.452198 -1.079472
H  2.2392 -1.365311 1.658873
H  2.299126 0.329615 2.243567
H  -2.445032 -2.146283 -0.369827
H  -2.578957 1.987574 0.925452
H  4.396873 0.743819 1.123798
H  4.536267 -1.030313 0.973241
H  -0.178907 -2.914379 -1.372026
H  1.306637 -2.245958 -0.669437
H  -0.52649 3.057823 1.666064
H  1.067516 2.288044 1.448896
H  -4.567814 -1.162377 0.367933
H  -4.619498 0.460016 1.09156
H  0.61402 -3.137763 1.619666
H  0.726112 -4.443585 0.401012
H  -0.871971 -3.810539 0.899327
H  1.034589 2.839553 -1.007645
H  0.846049 4.318105 -0.018357
H  -0.57817 3.597062 -0.828116
H  -4.485931 1.502559 -1.224071
H  -5.902673 0.419541 -1.069953
H  -4.443028 -0.126866 -1.951355
H  0.808138 0.344802 -2.26916
H  2.420989 0.378113 -2.981944
