program: Gaussian 09
title: 000151218
version: EM64L-G09RevD.01
frameworkgroup: C1[X(C4H7O5P)]
method: RPBEPBE
basis: SDD
operation: Freq
keyword: #pfreq=noraman
keyword: PBEPBE/SDD
title: #p freq=noraman PBEPBE/SDD
converged: YES YES NO NO
title: Mulliken charges:
elementType: P O O O O O C C C C H H H H H H H
charge: 1.246980 -0.678127 -0.671746 -0.613721 -0.426976 -0.240392 -0.886340 0.386079 0.128003 -0.576956 0.330007 0.309736 0.253718 0.265807 0.391952 0.393279 0.388697
chargesum: 0.00000
title: Mulliken charges with hydrogens summed into heavy atoms:
elementType: P O O O O O C C C C
charge: 1.246980 -0.286175 -0.278466 -0.613721 -0.038279 -0.240392 -0.246597 0.386079 0.128003 -0.057430
polarizability: 8.87555290e+01 -2.79046593e+00 9.14514081e+01 -4.63064988e+00 7.29129630e-01 6.29122353e+01
1716.lowfreq: -0.0024 -0.0017 -0.0007 4.1266 9.7126 12.0305 34.0375 37.4194 67.7333
frequency: 33.7631 37.2789 67.7230 113.1243 131.8907 182.5739 257.6344 262.0159 294.5597 313.7926 338.4988 360.3494 367.3910 414.6985 513.2062 544.2221 587.3361 605.2406 668.3779 716.8774 758.1811 758.8209 789.4267 894.6777 960.0486 985.9402 992.2040 1003.9876 1042.3111 1080.9432 1166.4648 1239.2454 1286.4676 1354.7080 1416.3053 1424.3356 1616.6011 1655.2653 3046.1864 3115.7557 3121.6341 3232.5919 3536.8927 3591.0169 3597.5714
redmass: 5.8408 6.1754 8.9406 3.9795 2.2045 9.3020 2.3348 3.9041 3.0121 5.5005 4.1194 1.5061 1.9918 4.0759 3.6590 4.1717 1.5683 1.8631 4.3328 7.8574 2.6513 4.3625 2.6885 1.8266 1.9157 1.9708 1.1841 1.3581 2.5813 2.2787 1.2864 1.4352 1.3907 2.7851 1.1743 1.2085 6.8720 6.4369 1.0585 1.0622 1.1047 1.1163 1.0643 1.0660 1.0663
irintensity: 0.4252 0.8475 0.9150 6.6573 10.8291 1.8072 22.5990 3.4815 37.9220 77.1975 63.7559 167.3450 4.2902 50.2893 22.8226 26.9912 81.0623 69.0070 91.3253 234.8177 24.2406 51.0514 21.8393 16.7256 1.1425 1.3966 41.4073 48.9213 265.3159 199.3578 20.5894 1.7911 42.8090 21.9364 23.1444 26.5487 163.9599 80.9652 4.6293 0.9287 4.2274 0.7947 46.3776 54.3690 53.7342
temp: 298.150 k
press: 1.00000 atm
elementType: 15 8 8 8 8 8 6 6 6 6 1 1 1 1 1 1 1
symmnumber: 1
zpe: 301926.3 jmol-1
zpe.correction: 0.114998 hartree
zpe.thermalcorrener: 0.127042 hartree
zpe.thermalcorrenthalpy: 0.127986 hartree
zpe.thermalcorrgfe: 0.075710 hartree
zpe.sumelectzpe: -873.173379 hartree
zpe.sumelectthermal: -873.161334 hartree
zpe.sumelectthermalent: -873.160390 hartree
zpe.sumelectthermalfe: -873.212667 hartree
dipole: 0.1092 2.4760 -0.5374
dipole: 2.5360
quadrupole: -50.1456 -66.8103 -71.1316
quadrupole: -1.3584 0.3694 3.1027
quadrupole: 12.5503 -4.1145 -8.4358 -1.3584 0.3694 3.1027
hfenergy: -873.2883768 hartree
pointgroup: C01 [X(C4H7O5P1)]
dipole: -0.0167797 0.9968712 -0.0378841 debye
dipolederiv: 1.9412082 0.1313838 -0.0612052 0.0609612 1.6197224 -0.1789125 0.0436 -0.0843437 1.5145669 -0.7670097 0.1930512 0.0180238 0.1752902 -0.9603271 0.2385891 -0.0384647 0.1519807 -0.5350744 -1.0902253 -0.1327815 0.3027596 -0.1161083 -0.6663359 0.1502499 0.302794 0.1807761 -0.6473008 -0.7090953 -0.0586894 -0.038744 0.0091902 -0.6364507 -0.016274 -0.0333167 -0.0934604 -0.6745392 -1.1393889 -0.1272148 0.3121103 -0.1575803 -0.2824599 0.0360979 0.3930204 0.005742 -0.571749 -0.6253022 0.1496746 0.0302923 -0.0626786 -0.8792532 0.2939275 0.1626036 0.1637762 -0.4525099 -0.2237852 -0.0113867 0.0361606 0.0056014 -0.1376731 -0.032497 -0.0438734 0.0219082 -0.156554 0.1266797 0.2177063 -0.0556925 0.287229 -0.3412857 0.0373972 -0.2438757 0.0015879 -0.0763363 1.3631549 -0.3121284 -0.3165359 -0.0672081 1.1493484 -0.3975618 -0.484456 -0.2185653 0.5584102 -0.0758174 -0.0515943 -0.1016449 -0.1681195 0.0084066 -0.062906 0.0104243 -0.1051075 -0.1807495 0.1396732 0.0204229 -0.040995 -0.0784369 0.0680598 0.0394872 -0.0159173 0.0324 0.0966123 0.0296104 -0.0126655 0.0073416 0.0240796 0.0452583 -0.0636899 0.0175863 -0.0420119 0.0504796 0.0427475 0.0941222 0.029874 0.0871846 0.0730675 0.0136662 0.0181644 0.0126686 0.1360206 0.027944 -0.0231465 0.0630669 -0.0272046 0.1258175 0.0271037 0.0801768 0.0336335 0.1516724 0.3300033 -0.0568712 -0.0933787 -0.0174684 0.3158247 -0.0427927 -0.1012855 -0.0637578 0.1872791 0.2864434 -0.0713134 -0.0998654 -0.0591714 0.3379806 -0.0908409 -0.0530787 -0.0713762 0.223892 0.3431595 0.0514308 0.0084322 0.1044401 0.1602996 0.0489561 -0.0141019 0.0741495 0.3758798 unknown
polarizability: 89.2817586|1.9099268|89.2650709|-4.2218929|-7.2924156|64.5723429 unknown
InChI: InChI=1S/C4H7O5P/c1-3(4(5)6)2-10(7,8)9/h5,7-8H,1-2H2
charge 0 multiplicity 1
17 atoms
P  -1.793802 -0.115054 -0.23482
O  -2.146482 1.533402 -0.675122
O  -3.042057 -0.562363 0.883907
O  -1.648027 -1.085173 -1.49085
O  3.080706 -0.005397 -0.447049
O  1.846127 -1.5703 0.744582
C  -0.410847 0.179605 0.981891
C  0.877239 0.626547 0.321594
C  1.937669 -0.422635 0.2436
C  1.081476 1.884401 -0.158615
H  -0.265792 -0.770197 1.52148
H  -0.80409 0.936555 1.679167
H  0.289602 2.639123 -0.105491
H  2.033985 2.156167 -0.622131
H  -2.581264 1.626352 -1.560956
H  -3.771926 -1.103625 0.488617
H  3.739181 -0.750308 -0.458104
