program: Gaussian 09
title: 000151213
version: EM64L-G09RevD.01
frameworkgroup: C1[X(C4H7NO2)]
method: RPBEPBE
basis: SDD
operation: Freq
keyword: #pfreq=noraman
keyword: PBEPBE/SDD
title: #p freq=noraman PBEPBE/SDD
converged: YES YES NO NO
title: Mulliken charges:
elementType: O O N C C C C H H H H H H H
charge: -0.402151 -0.261648 -0.667115 -0.580545 0.468727 0.226095 -0.746821 0.259644 0.254747 0.295730 0.338029 0.212039 0.224605 0.378663
chargesum: 0.00000
title: Mulliken charges with hydrogens summed into heavy atoms:
elementType: O O N C C C C
charge: -0.023488 -0.261648 -0.033356 -0.066154 0.468727 0.226095 -0.310177
polarizability: 6.94558535e+01 6.06488504e+00 6.54321757e+01 3.06686530e+00 1.92963777e+00 3.61652285e+01
1716.lowfreq: -6.7755 -0.0008 -0.0007 -0.0007 12.2001 15.7356 47.3819 80.1797 210.2362
frequency: 47.1880 80.1416 210.2316 356.4738 377.7604 429.4268 452.1542 503.8609 528.5450 548.5650 637.7701 684.2266 694.4456 808.6984 861.3770 893.2942 940.1872 985.2978 1059.5424 1110.8402 1187.4898 1258.6748 1346.2818 1367.3773 1430.2925 1440.3207 1620.9943 1659.1040 1667.1717 2980.8592 3114.2861 3126.4374 3227.7940 3498.7287 3502.2818 3657.1150
redmass: 5.3630 3.7064 4.9227 5.3347 2.4856 1.0798 1.9090 2.6795 2.4346 1.2010 2.0794 1.9539 1.1483 1.3762 4.3073 3.9032 1.9778 1.5972 2.0233 1.5747 1.1706 1.4359 2.0627 3.6286 1.1358 1.1282 1.8523 2.1137 6.1425 1.0680 1.0629 1.0923 1.1136 1.0537 1.0580 1.1006
irintensity: 1.7897 0.9825 7.0790 4.6013 0.8530 58.3775 7.8169 9.7852 43.7226 244.1281 90.5898 109.4346 18.7781 141.2545 5.4682 19.4939 6.7445 7.9336 255.0961 15.0819 11.3531 0.9095 81.5882 40.4451 13.4749 12.9411 235.6822 5.2084 297.3675 12.2784 4.9846 3.9609 15.7898 86.9668 20.7404 38.9928
temp: 298.150 k
press: 1.00000 atm
elementType: 8 8 7 6 6 6 6 1 1 1 1 1 1 1
symmnumber: 1
zpe: 288869.7 jmol-1
zpe.correction: 0.110025 hartree
zpe.thermalcorrener: 0.117638 hartree
zpe.thermalcorrenthalpy: 0.118582 hartree
zpe.thermalcorrgfe: 0.077729 hartree
zpe.sumelectzpe: -361.265773 hartree
zpe.sumelectthermal: -361.258160 hartree
zpe.sumelectthermalent: -361.257216 hartree
zpe.sumelectthermalfe: -361.298069 hartree
dipole: 0.7889 0.0975 -0.0127
dipole: 0.7950
quadrupole: -36.4013 -43.0938 -42.5144
quadrupole: -4.3082 0.4931 -1.4329
quadrupole: 4.2686 -2.4240 -1.8446 -4.3082 0.4931 -1.4329
hfenergy: -361.3757974 hartree
pointgroup: C01 [X(C4H7N1O2)]
dipole: -0.3000628 -0.0759824 0.0448933 debye
dipolederiv: -1.0441049 0.3990089 -0.2237679 0.3312964 -0.4051052 0.0931152 -0.3141286 0.1198323 -0.5030182 -0.6902404 -0.129556 -0.0135063 0.1418965 -0.9552693 0.2041683 -0.1462547 0.1230435 -0.4007588 -0.4040952 0.2232568 -0.2760812 -0.1169107 -1.0033931 0.316827 -0.0642393 0.2774229 -0.8394692 -0.2476712 -0.050297 -0.0515023 -0.0721712 -0.0910703 -0.0126849 -0.0035679 -0.0394435 0.0740672 0.3839797 -0.0624829 -0.0946629 -0.0390121 0.9831421 -0.5731475 -0.2748891 -0.489863 0.4677195 1.4310206 -0.0433911 0.3422993 -0.1662156 1.204007 -0.3219448 0.5233261 -0.2546767 0.408187 -0.3398908 -0.4027408 0.0080439 -0.1792934 -0.3861015 0.0177427 -0.0884786 0.086997 -0.6176311 0.055303 -0.0211381 0.0218905 -0.0199269 0.0991581 0.0159165 0.069556 -0.007059 -0.0876169 0.0612674 0.0093447 -0.0022085 0.0297864 -0.0179518 0.055924 -0.0173694 0.0879998 0.0883159 0.1293692 0.0145021 0.1156613 0.0432436 0.1898343 0.0398921 0.1425153 0.0163128 0.2990239 0.3734151 -0.020189 0.0444977 0.0051394 0.204649 0.0408707 0.0255738 -0.0494654 0.3888801 -0.0682244 0.0856724 0.1104169 0.1103307 0.0619349 0.0209555 0.1240378 0.0416291 0.1556802 0.0814734 0.1011041 0.0348693 0.0773648 -0.0361467 0.0827288 0.0377699 0.0582745 0.1750475 0.2783984 -0.1030942 -0.0159496 -0.1455279 0.1523125 0.0196364 -0.0138512 0.0289957 0.3915728 unknown
polarizability: 67.0117923|4.0536128|61.1116516|-6.5763714|-12.7610519|42.9298139 unknown
InChI: InChI=1S/C4H7NO2/c1-3(5)2-4(6)7/h6H,1-2,5H2
charge 0 multiplicity 1
14 atoms
O  -2.369514 0.39241 -0.178781
O  -1.247336 -1.448679 0.66611
N  1.602926 -1.049577 0.485502
C  -0.090203 0.740728 0.547077
C  1.248015 0.218294 0.016191
C  -1.244429 -0.230284 0.362546
C  2.028744 1.004795 -0.787751
H  0.005149 0.915364 1.639019
H  -0.338128 1.697974 0.069262
H  2.472724 -1.469776 0.166144
H  0.870568 -1.664873 0.84432
H  3.008387 0.669528 -1.144667
H  1.701473 2.00297 -1.083848
H  -3.107374 -0.272075 -0.265925
