program: Gaussian 09
title: 000151204
version: EM64L-G09RevD.01
frameworkgroup: C1[X(C9H18O5Si)]
method: RPBEPBE
basis: SDD
operation: Freq
keyword: #p
keyword: freq=noraman
keyword: PBEPBE/SDD
title: #p freq=noraman PBEPBE/SDD
converged: YES YES NO NO
title: Mulliken charges:
elementType: Si O O O O O C C C C C C C C C H H H H H H H H H H H H H H H H H H
charge: 1.553833 -0.576425 -0.577844 -0.592244 -0.273504 -0.249908 -0.931435 -0.336471 -0.263520 -0.490386 -0.489702 -0.476687 0.252687 -0.210723 -0.475036 0.256006 0.256084 0.228773 0.229673 0.224031 0.223971 0.205367 0.217008 0.239466 0.239532 0.215733 0.205568 0.218035 0.219863 0.229139 0.253428 0.228672 0.247015
chargesum: 0.00000
title: Mulliken charges with hydrogens summed into heavy atoms:
elementType: Si O O O O O C C C C C C C C C
charge: 1.553833 -0.576425 -0.577844 -0.592244 -0.273504 -0.249908 -0.419344 0.121975 0.184482 0.171456 0.171131 0.190350 0.252687 0.042705 0.000651
polarizability: 1.87752003e+02 -1.50908512e-01 1.11135505e+02 5.94041847e+00 -1.02990936e-02 1.14568339e+02
1716.lowfreq: -2.8723 0.0015 0.0017 0.0021 5.6436 13.0718 19.0688 20.2276 27.1490
frequency: 16.6743 19.7981 24.9624 43.1985 54.6951 56.8541 72.6806 80.8055 82.5659 85.3982 86.8353 89.3927 117.3850 126.4719 136.2005 149.3401 196.2734 209.0757 227.2202 229.2735 291.8907 310.2390 341.9174 362.4141 415.9421 486.4715 507.5993 571.8913 648.9629 686.8338 715.6993 756.4350 779.7027 780.4739 825.7871 846.9118 940.7564 994.8135 1006.6864 1013.7207 1028.3086 1047.7007 1052.4138 1062.8151 1069.0590 1082.6774 1119.5892 1123.0272 1124.0855 1132.4945 1144.0017 1146.6255 1151.0476 1157.2134 1233.2024 1250.6461 1287.5786 1289.1095 1322.5779 1371.0581 1411.6464 1432.6486 1444.7219 1447.2846 1450.3865 1468.2862 1468.8658 1470.3434 1473.5187 1474.7881 1475.3030 1476.5148 1486.8465 1622.8667 1642.3056 2942.3104 2944.0236 2960.2130 2988.6218 2994.4296 3006.4377 3024.7013 3025.4782 3036.2660 3047.5209 3050.9954 3077.0123 3090.2844 3090.4779 3094.7362 3104.0976 3158.3171 3219.9557
redmass: 3.7705 3.9421 4.4296 4.0740 3.9800 2.9762 1.5883 1.4236 1.1454 1.3067 1.6283 2.5297 2.8629 3.5752 5.0601 2.8677 4.9751 2.8724 4.1787 3.7863 5.1848 5.0810 5.9086 4.4615 6.3798 5.1381 1.7638 5.9690 3.9265 2.8600 8.7606 1.3199 3.3502 6.2025 1.4670 4.5198 7.0075 1.4056 1.0770 1.3222 4.5117 6.1692 5.1944 1.6191 4.8896 2.7821 1.2513 1.2569 1.2532 4.0465 1.3882 1.4313 1.4954 1.2361 1.3167 1.2295 1.4185 1.0813 1.3519 1.4776 1.2277 1.0856 1.1221 1.1221 1.1147 1.0597 1.0518 1.0663 1.0531 1.0537 1.0529 1.0516 1.0893 11.4877 4.5209 1.0333 1.0336 1.0311 1.0592 1.0582 1.0588 1.1025 1.1025 1.1001 1.1038 1.1042 1.1063 1.0993 1.0993 1.1017 1.0599 1.0958 1.1157
irintensity: 1.6464 0.0934 0.8990 0.1009 1.5648 9.4229 1.6340 2.9477 1.6251 0.5577 1.1932 1.0010 0.0587 2.7222 18.2405 10.7676 13.3636 8.5555 9.9266 2.1489 8.3538 27.0763 15.9199 31.3152 20.5662 4.8383 0.0586 33.3596 1.8799 12.7544 113.0702 41.2189 17.6859 117.0117 33.2344 2.2939 44.1362 35.8438 44.4385 0.8321 114.5915 218.4692 460.8404 6.6470 32.7168 57.6463 0.0740 6.2900 0.5831 444.8442 14.0775 75.6422 1.4948 9.8262 36.5025 2.8228 45.9792 0.2209 3.1200 7.8740 73.3201 12.7220 0.9578 0.2716 4.1472 6.3911 10.3238 7.0005 5.3557 5.2505 3.3748 11.1854 10.6414 150.6998 20.7420 143.2670 13.4643 79.2111 5.4069 6.3070 32.5812 11.8976 120.6120 3.1384 50.8300 0.1633 54.7736 14.0477 53.6574 32.4161 4.8119 3.9194 8.1787
temp: 298.150 k
press: 1.00000 atm
elementType: 14 8 8 8 8 8 6 6 6 6 6 6 6 6 6 1 1 1 1 1 1 1 1 1 1 1 1 1 1 1 1 1 1
symmnumber: 1
zpe: 691966.0 jmol-1
zpe.correction: 0.263556 hartree
zpe.thermalcorrener: 0.284926 hartree
zpe.thermalcorrenthalpy: 0.285870 hartree
zpe.thermalcorrgfe: 0.207814 hartree
zpe.sumelectzpe: -1018.080599 hartree
zpe.sumelectthermal: -1018.059229 hartree
zpe.sumelectthermalent: -1018.058285 hartree
zpe.sumelectthermalfe: -1018.136341 hartree
dipole: 0.8773 -0.0105 0.0639
dipole: 0.8797
quadrupole: -86.6248 -86.3272 -107.9597
quadrupole: -0.0187 15.5301 -0.0224
quadrupole: 7.0124 7.3100 -14.3224 -0.0187 15.5301 -0.0224
hfenergy: -1018.3441551 hartree
pointgroup: C01 [X(C9H18O5Si1)]
dipole: 0.3450904 -0.0027256 0.0262288 debye
polarizability: 187.7139901|0.1585411|111.135586|6.1698037|0.0250421|114.6062712 unknown
InChI: InChI=1S/C9H18O5Si/c1-5-9(10)14-7-6-8-15(11-2,12-3)13-4/h5H,1,6-8H2,2-4H3
charge 0 multiplicity 1
33 atoms
Si 2.623106 0.008732 -0.02104
O  2.81796 -1.320181 -1.092999
O  2.779876 1.333748 -1.103366
O  3.831539 0.024367 1.208114
O  -2.676569 -0.019942 -0.253681
O  -4.209566 -0.009721 1.512243
C  0.967639 -0.006777 0.898528
C  -0.256104 -0.013129 -0.054351
C  -1.563834 -0.014909 0.738984
C  2.756834 -2.728089 -0.719579
C  2.723808 2.743534 -0.737626
C  5.276752 0.034045 0.979844
C  -3.973285 -0.016231 0.278697
C  -4.970824 -0.02075 -0.823231
C  -6.304013 -0.018037 -0.56434
H  0.947724 -0.892939 1.563385
H  0.935886 0.876976 1.566247
H  -0.22831 -0.900314 -0.714679
H  -0.2335 0.870692 -0.719268
H  -1.666466 0.881192 1.379766
H  -1.661919 -0.908731 1.383657
H  1.783642 -2.992928 -0.256591
H  3.569932 -3.001682 -0.018054
H  2.874781 -3.306678 -1.65002
H  2.822198 3.316657 -1.673717
H  3.550353 3.02315 -0.054317
H  1.75976 3.009762 -0.256668
H  5.603803 0.997269 0.542979
H  5.586139 -0.785214 0.302091
H  5.756611 -0.101942 1.962679
H  -4.570234 -0.026251 -1.842153
H  -7.044637 -0.02131 -1.370687
H  -6.666784 -0.012568 0.470253
