program: Gaussian 09
title: 000151184
version: EM64L-G09RevD.01
frameworkgroup: C1[X(C9H19NO4Si)]
method: RPBEPBE
basis: SDD
operation: Freq
keyword: #p
keyword: freq=noraman
keyword: PBEPBE/SDD
title: #p freq=noraman PBEPBE/SDD
converged: NO YES NO NO
title: Mulliken charges:
elementType: Si O O O O N C C C C C C C C C H H H H H H H H H H H H H H H H H H H
charge: 1.563137 -0.529067 -0.536373 -0.519085 -0.593663 -0.274237 -0.370741 -0.366095 -0.369909 -0.275624 -0.276936 -0.279022 -0.199906 -0.368598 -0.685876 0.223078 0.236611 0.223372 0.233809 0.222736 0.237133 0.225927 0.192380 0.225282 0.196738 0.228890 0.195408 0.196065 0.191757 0.211399 0.211228 0.206318 0.217937 0.205928
chargesum: 0.00000
title: Mulliken charges with hydrogens summed into heavy atoms:
elementType: Si O O O O N C C C C C C C C C
charge: 1.563137 -0.529067 -0.536373 -0.519085 -0.593663 -0.274237 0.088948 0.091086 0.089960 0.142683 0.145083 0.145276 0.187916 0.054029 -0.055693
polarizability: 1.55713760e+02 1.60541312e+00 1.23158655e+02 -2.28409199e-02 1.34266664e-02 1.21478328e+02
1716.lowfreq: -12.3200 -6.5015 -0.0011 -0.0004 0.0011 9.0576 28.0943 49.1193 58.7931
frequency: 27.4826 48.7981 58.7451 80.6903 113.1917 151.3735 154.5678 183.0249 207.8733 213.9812 222.4148 254.4948 278.7718 292.7708 312.3525 336.2961 337.4503 374.9552 419.5617 422.7420 464.7252 521.6236 559.0885 578.1927 582.3089 693.5716 716.9267 720.1447 761.1979 765.0101 864.4500 868.0658 883.3689 883.8230 894.2733 922.5400 923.2370 1002.1937 1043.5115 1044.2027 1046.9526 1053.9498 1064.5811 1065.6801 1071.1639 1092.2954 1129.7756 1143.6028 1151.4173 1152.2802 1201.1965 1216.7936 1217.7240 1227.3665 1249.0365 1262.0009 1264.4775 1278.4433 1303.0117 1341.1192 1345.3701 1345.9289 1357.7618 1358.6461 1361.2516 1372.8584 1390.2502 1456.7679 1459.1148 1461.4404 1471.8941 1479.0179 1482.1022 1483.4705 1483.7540 1484.9575 1490.7430 2943.4401 2957.7237 2959.7265 2961.5331 2971.0239 2971.5468 2971.9359 2977.9222 2997.6271 3001.4471 3046.8853 3052.2877 3054.4574 3056.9848 3065.2620 3070.4714 3072.2086 3073.7194 3076.2822
redmass: 3.7065 1.8265 3.4161 4.3679 2.6965 3.6999 3.1527 5.0678 3.0458 1.3368 2.2906 4.0338 1.9263 4.9939 3.7343 4.3102 4.1994 4.4580 3.1713 3.0619 4.4199 8.7817 2.9737 2.7041 2.7200 10.4069 6.5200 3.1224 1.0773 5.8874 1.9581 1.9493 2.2413 1.1523 1.7900 2.1673 2.1706 2.6766 4.4120 2.7361 2.4456 3.6147 4.5712 3.2827 2.8675 3.9786 2.2048 1.4584 1.7021 1.7202 1.0913 1.2585 1.2512 1.2660 1.1816 1.5422 1.5315 1.1023 1.3393 1.2838 1.2655 1.2587 1.2903 1.3079 1.3122 1.4079 1.2126 1.0883 1.0884 1.0863 1.0633 1.0421 1.0715 1.0803 1.0810 1.0807 1.0819 1.0553 1.0666 1.0668 1.0658 1.0657 1.0653 1.0358 1.0657 1.1055 1.0605 1.1010 1.0961 1.0953 1.0963 1.0988 1.1000 1.0997 1.0987 1.1032
irintensity: 3.8324 2.9900 3.7733 9.9926 3.1745 4.4847 0.9863 30.9381 2.7800 0.8631 2.3452 8.1184 3.6224 14.4124 4.3540 10.4917 13.9019 9.9540 0.0501 0.1787 4.5904 0.2711 68.1568 6.6549 8.8764 144.9129 115.3393 54.4678 6.4624 139.8642 10.6663 11.7788 79.4203 3.9618 7.2879 16.6128 16.8469 48.0233 210.5437 62.8850 28.6855 282.2089 79.9800 61.2656 28.5442 29.8143 2.2757 0.2731 3.2734 3.3729 3.0987 1.7236 2.4404 0.0972 10.6826 13.3940 13.4820 0.5656 0.0288 3.8540 1.2010 1.4436 2.5494 2.7282 2.1180 7.1556 18.5350 8.7991 7.6643 8.1122 2.1784 12.0408 1.1238 9.8771 7.9788 4.3139 14.0813 47.3448 41.3624 43.8834 42.8758 42.4985 45.2245 55.4955 151.3247 25.1179 28.1218 0.1081 28.5606 36.0324 34.7325 1.0976 49.6927 38.2826 54.4699 96.7238
temp: 298.150 k
press: 1.00000 atm
elementType: 14 8 8 8 8 7 6 6 6 6 6 6 6 6 6 1 1 1 1 1 1 1 1 1 1 1 1 1 1 1 1 1 1 1
symmnumber: 1
zpe: 749368.8 jmol-1
zpe.correction: 0.285419 hartree
zpe.thermalcorrener: 0.301665 hartree
zpe.thermalcorrenthalpy: 0.302609 hartree
zpe.thermalcorrgfe: 0.241425 hartree
zpe.sumelectzpe: -998.244268 hartree
zpe.sumelectthermal: -998.228023 hartree
zpe.sumelectthermalent: -998.227079 hartree
zpe.sumelectthermalfe: -998.288262 hartree
dipole: 7.1721 -2.8807 -0.1187
dipole: 7.7299
quadrupole: -82.2763 -97.6425 -95.4514
quadrupole: 2.1567 -0.0980 -0.2010
quadrupole: 9.5138 -5.8524 -3.6614 2.1567 -0.0980 -0.2010
hfenergy: -998.5296877 hartree
pointgroup: C01 [X(C9H19N1O4Si1)]
dipole: 2.8454242 -1.0548266 0.1992214 debye
polarizability: 155.6253911|2.1723543|123.1333826|-0.8557183|-0.4287167|121.5919684 unknown
InChI: InChI=1S/C9H19NO4Si/c1-2-6-11-15-12-7-3-10(4-8-13-15)5-9-14-15/h2-9H2,1H3
charge 0 multiplicity 1
34 atoms
Si -0.177243 0.264136 -0.083643
O  -0.079116 -0.913875 -1.384736
O  -0.06352 -0.399846 1.540136
O  0.460319 1.866103 -0.352385
O  -1.842529 0.661682 -0.159282
N  2.159235 -0.225452 -0.00959
C  2.363339 -1.040011 -1.240703
C  2.303421 -0.971906 1.272296
C  2.775088 1.131188 -0.033818
C  1.051691 -1.814474 -1.510767
C  1.206219 -0.466574 2.239441
C  1.819402 2.058582 -0.821483
C  -2.916339 -0.301791 0.097323
C  -4.253842 0.411612 -0.130286
C  -5.45918 -0.517612 0.133458
H  3.231964 -1.724399 -1.149287
H  2.553245 -0.347522 -2.079623
H  3.317588 -0.860554 1.708211
H  2.130601 -2.042085 1.062132
H  3.793841 1.120547 -0.47309
H  2.847274 1.490528 1.007813
H  1.044726 -2.22107 -2.536983
H  0.944532 -2.660565 -0.799323
H  1.087536 -1.162458 3.088167
H  1.46887 0.533659 2.643899
H  2.079079 3.118087 -0.655655
H  1.8802 1.849981 -1.910548
H  -2.845379 -0.672514 1.141548
H  -2.816964 -1.169252 -0.589552
H  -4.29422 1.295902 0.533101
H  -4.276294 0.790721 -1.169217
H  -5.458715 -0.888572 1.176292
H  -6.413693 0.013472 -0.034192
H  -5.441833 -1.398469 -0.536654
