program: Gaussian 09
title: 000014245
version: EM64L-G09RevD.01
frameworkgroup: C1[X(C7H12)]
method: RPBEPBE
basis: SDD
operation: Freq
keyword: #p
keyword: freq=noraman
keyword: PBEPBE/SDD
title: #p freq=noraman PBEPBE/SDD
converged: YES YES NO NO
title: Mulliken charges:
elementType: C C C C C C C H H H H H H H H H H H H
charge: -0.345149 -0.340374 -0.471016 -0.692201 0.036027 -0.057588 -0.747199 0.205207 0.204832 0.193566 0.193465 0.221803 0.221849 0.216184 0.211423 0.211409 0.246012 0.245880 0.245870
chargesum: 0.00000
title: Mulliken charges with hydrogens summed into heavy atoms:
elementType: C C C C C C C
charge: 0.064890 0.046657 -0.027364 -0.053185 0.036027 -0.057588 -0.009437
polarizability: 1.08494781e+02 8.26618571e+00 6.21989131e+01 2.09722206e-02 -5.30737768e-03 5.54510153e+01
1716.lowfreq: -55.1881 -11.1039 -9.1644 -0.0006 -0.0005 0.0006 14.8565 61.8277 72.1409
frequency: -2.1068 59.8568 72.1247 81.4985 200.7032 209.9642 232.3213 294.8352 358.6644 363.6755 481.3574 723.9542 753.3633 777.6261 894.3989 913.8517 1004.4728 1031.3747 1032.6581 1070.1057 1101.4663 1104.7491 1168.1583 1206.6023 1250.1501 1271.7728 1284.3399 1318.7103 1347.6888 1386.2353 1401.7294 1457.3696 1464.0758 1464.9012 1465.0901 1475.4540 1476.9720 1486.1443 2286.1940 2958.3582 2963.2706 2972.2390 2973.3441 2986.2401 2999.4666 3008.4335 3050.8921 3059.1540 3059.8722 3071.0126 3072.3532
redmass: 1.0348 1.9262 3.3538 2.1192 2.2414 3.1241 1.1994 3.7957 4.1028 3.5409 4.3681 1.0767 4.0295 1.1871 1.7690 1.2272 4.3510 1.3834 1.3834 2.5691 1.3893 2.1732 3.2994 1.4325 1.3486 1.1599 1.0694 1.4517 1.5891 1.2116 1.2246 1.0821 1.0428 1.0419 1.0664 1.0706 1.0425 1.0792 11.6317 1.0581 1.0584 1.0349 1.0364 1.0592 1.0988 1.1012 1.1043 1.0984 1.0985 1.1011 1.0993
irintensity: 0.0007 0.4311 1.3172 0.0000 12.2725 5.8215 1.6613 4.9502 0.1437 0.9000 2.9710 10.7921 0.0314 0.2791 7.1403 1.6878 1.1968 3.8438 3.4151 0.8788 0.0222 9.6175 0.6811 0.5542 2.2469 0.7972 0.1202 4.3859 1.2665 11.4193 0.8425 1.1762 12.2132 12.3646 0.8549 4.6204 12.7452 16.8148 0.1438 18.8377 38.5301 53.0464 23.6586 57.0646 11.9268 1.0692 29.3049 18.7790 18.2713 100.6161 53.5248
temp: 298.150 k
press: 1.00000 atm
elementType: 6 6 6 6 6 6 6 1 1 1 1 1 1 1 1 1 1 1 1
symmnumber: 1
zpe: 437529.7 jmol-1
zpe.correction: 0.166646 hartree
zpe.thermalcorrener: 0.175547 hartree
zpe.thermalcorrenthalpy: 0.176491 hartree
zpe.thermalcorrgfe: 0.132476 hartree
zpe.sumelectzpe: -273.322666 hartree
zpe.sumelectthermal: -273.313765 hartree
zpe.sumelectthermalent: -273.312821 hartree
zpe.sumelectthermalfe: -273.356836 hartree
dipole: 0.0960 -0.1013 -0.0072
dipole: 0.1397
quadrupole: -38.5207 -44.3384 -44.4933
quadrupole: 2.7273 0.0212 0.0001
quadrupole: 3.9301 -1.8876 -2.0425 2.7273 0.0212 0.0001
hfenergy: -273.4893125 hartree
pointgroup: C01 [X(C7H12)]
dipole: -0.0379189 0.0397264 -0.0023028 debye
dipolederiv: 0.0118651 -0.0115005 0.0012043 -0.1321674 0.0438775 -0.0010659 -0.0022497 -0.0035042 0.1706327 0.0222632 0.020017 0.0001471 0.1038649 0.0948879 -0.0019079 0.0012439 -0.00094 0.1859483 0.0873462 0.0539862 0.0020354 0.0791059 0.1513354 -0.0052407 -0.0007069 0.0026701 0.2101296 -0.0680817 0.0583125 0.0008371 0.0130636 0.0307539 -0.0006759 -0.0000535 -0.0007238 0.0931127 -0.0647883 0.0456729 0.0021511 0.1232868 -0.1418014 0.0021193 0.0041141 -0.0003485 -0.1428744 -0.0901139 0.0906187 -0.0003899 0.0322682 -0.1712149 -0.0020009 -0.0053053 0.0021602 -0.1936262 0.0996875 -0.0143551 -0.0009268 -0.0118595 0.1219681 0.0045438 0.0101255 -0.0040256 0.1240458 0.0452476 -0.0090788 -0.0195787 -0.0080104 -0.0258709 -0.1094106 -0.0176173 -0.1253727 -0.0805239 0.0452011 -0.0100421 0.0192076 -0.0089249 -0.034384 0.111108 0.0177605 0.1270093 -0.072532 0.0296162 0.0080404 0.0013683 -0.0193403 -0.0548699 0.1291843 0.0286335 0.1525004 -0.0881652 0.0300238 0.0090092 -0.0003909 -0.0178827 -0.0464577 -0.1278914 -0.0284764 -0.1513544 -0.0966815 -0.0121327 -0.0630857 0.0386833 -0.0374336 -0.0138098 0.0986605 0.0463266 0.1331434 -0.0399134 -0.0132414 -0.058614 -0.0433405 -0.0362115 -0.0040208 -0.0961669 -0.0471596 -0.1329451 -0.0491702 -0.223674 -0.059487 -0.0010966 -0.0845833 0.0436987 -0.0008934 -0.0015906 -0.0008292 0.1010724 0.0875756 -0.017121 -0.0458159 0.028459 -0.017186 -0.114467 -0.0012926 -0.1388841 -0.0918927 0.0872991 -0.0185993 0.0456624 0.0282245 -0.0240899 0.1163837 0.002434 0.1406815 -0.0848905 -0.0890878 0.0483247 0.0581052 0.0899603 0.018838 -0.0725087 0.0836787 -0.0620402 0.0782897 -0.0065834 -0.0471237 -0.056269 -0.0548686 0.1041163 -0.0301823 -0.1133202 -0.0469663 -0.0887256 0.0215777 -0.0249745 -0.0015934 -0.0869512 -0.0757707 0.1004121 0.0234552 0.1097691 0.0657645 unknown
polarizability: 108.4253598|8.4566908|62.266585|0.1539185|0.1096448|55.452765 unknown
InChI: InChI=1S/C7H12/c1-3-5-7-6-4-2/h3,5,7H2,1-2H3
charge 0 multiplicity 1
19 atoms
C  -1.161819 0.224409 0.003199
C  -2.596088 -0.349483 -0.009026
C  -0.081105 -0.893621 -0.014746
C  -3.680226 0.74933 0.004531
C  1.30132 -0.378106 -0.003702
C  2.452537 0.068907 0.004471
C  3.827747 0.595278 0.010099
H  -1.016223 0.854195 0.90239
H  -1.013649 0.88509 -0.873156
H  -2.731071 -1.014691 0.868437
H  -2.726601 -0.988167 -0.906643
H  -0.235509 -1.557721 0.860398
H  -0.233381 -1.526826 -0.912818
H  -4.69681 0.315118 -0.002354
H  -3.59004 1.384409 0.905815
H  -3.588192 1.408318 -0.879258
H  4.527732 -0.108599 -0.477086
H  4.187426 0.766633 1.041609
H  3.889751 1.557728 -0.530961
