program: Gaussian 09
title: 000152941
version: EM64L-G09RevD.01
frameworkgroup: C1[X(C15H21Cl2NO)]
method: RPBEPBE
basis: SDD
operation: Freq
keyword: #p
keyword: freq=noraman
keyword: PBEPBE/SDD
title: #p freq=noraman PBEPBE/SDD
converged: YES YES NO NO
title: Mulliken charges:
elementType: Cl Cl O N C C C C C C C C C C C C C C C H H H H H H H H H H H H H H H H H H H H H
charge: -0.018509 -0.003395 -0.281437 -0.180585 0.039979 -0.042004 -0.374591 -0.349160 -0.743851 -0.715260 0.129274 -0.711303 -0.702473 0.299896 -0.313294 -0.392334 -0.083915 -0.199322 -0.110805 0.176780 0.229922 0.203971 0.261520 0.199377 0.203249 0.211575 0.268621 0.219559 0.226648 0.214976 0.227926 0.221965 0.221965 0.199929 0.220104 0.224479 0.216445 0.270642 0.272045 0.261391
chargesum: 0.00000
title: Mulliken charges with hydrogens summed into heavy atoms:
elementType: Cl Cl O N C C C C C C C C C C C C C C C
charge: -0.018509 -0.003395 -0.281437 -0.180585 0.216760 0.187917 0.090900 0.053466 -0.044096 -0.045710 0.129274 -0.067444 -0.041446 0.299896 -0.042651 -0.120290 -0.083915 0.062070 -0.110805
polarizability: 2.62395205e+02 7.69197618e+00 1.86818786e+02 4.63164899e+00 -1.45564420e+01 1.36431513e+02
1716.lowfreq: -7.1605 -0.0022 -0.0020 0.0010 2.5857 8.1136 26.8898 32.5042 36.3590
frequency: 26.8512 32.4330 36.3432 52.2580 74.4727 77.4249 89.8062 112.4525 125.7099 151.5769 177.5503 189.1521 192.4325 206.4999 220.6569 222.7652 241.8254 247.2149 270.5196 276.0839 277.9414 320.6559 330.9736 341.3395 395.1422 419.0652 426.6548 442.6316 456.9288 502.6282 511.1561 542.0992 602.1688 653.1089 662.2289 690.5743 732.2527 758.5277 770.4554 784.1410 831.1686 834.2605 842.8743 883.2696 899.1013 950.7995 961.8131 963.3473 966.4417 976.3793 1003.0601 1017.2099 1037.1154 1056.3340 1082.3432 1117.5348 1133.6078 1137.2159 1145.1376 1150.1685 1156.5627 1175.0963 1192.9097 1246.1620 1256.5904 1260.4965 1293.4470 1308.2687 1320.7706 1325.4374 1336.5791 1353.0752 1361.7800 1377.1416 1381.3502 1385.3218 1391.6902 1395.7882 1412.4817 1456.7550 1464.0362 1465.6675 1472.4901 1473.2664 1478.7571 1483.6936 1484.7629 1489.1898 1490.4613 1495.0134 1541.9555 1563.5309 1589.6871 2971.5024 2976.3431 2980.4857 2987.5878 2992.4119 2999.4262 3001.2782 3024.2720 3044.5661 3054.1839 3074.9237 3075.5688 3080.9518 3082.1015 3086.6191 3088.0129 3091.5391 3111.6379 3159.3901 3162.0058 3178.0338
redmass: 5.9067 3.7345 4.9677 3.2045 2.6521 2.5026 2.2325 5.4191 3.6692 5.6876 5.0196 4.5783 3.3496 1.2930 1.3413 1.6950 1.6730 1.3277 2.8431 2.7269 3.0759 2.7409 4.1439 7.0862 4.4617 5.3023 2.5196 3.3109 4.6044 4.3447 3.8367 5.2894 5.0157 5.4785 3.9960 5.5316 3.7467 2.9355 1.3047 1.5150 1.6143 1.6946 2.0394 2.1897 1.5850 1.6935 1.2204 1.3687 1.1960 1.7935 5.0992 1.9300 2.7560 2.6707 2.0725 2.1619 2.4804 2.3170 2.2341 1.7935 2.1004 2.4092 2.2661 1.3565 1.2236 1.3852 1.5580 1.3799 1.4339 1.4002 1.5462 3.5605 1.3672 4.8059 1.2406 1.2215 1.2214 1.2112 1.7404 2.6853 1.0795 1.0662 1.0465 1.0555 1.0589 1.0621 1.0582 1.0533 1.0595 1.0733 6.9878 7.9459 6.8108 1.0375 1.0591 1.0372 1.0366 1.0395 1.0649 1.0790 1.0971 1.0885 1.0964 1.0997 1.0980 1.0993 1.0992 1.0988 1.0993 1.0993 1.1000 1.0885 1.0917 1.0975
irintensity: 0.5808 0.2020 0.3350 0.4422 1.1159 0.2968 0.2068 0.6211 2.0682 1.4987 0.0360 0.6377 0.5351 0.1134 0.1472 0.5557 0.0273 0.1132 2.8762 1.4221 2.5453 0.1681 3.5528 3.5126 4.6507 2.4355 1.5427 6.3029 12.9249 17.7657 5.6562 15.1645 6.3292 7.0741 18.8006 2.8727 18.4183 10.1873 13.4256 5.1147 16.4310 15.6892 11.9482 23.5900 16.7027 10.2119 9.2517 0.8734 2.7589 3.5534 51.8642 14.7344 4.5143 20.8644 24.7734 49.2324 25.9378 3.2572 19.5932 3.2617 9.7501 0.9646 18.5240 18.7481 6.8815 6.4840 119.3079 26.8752 73.2245 21.7002 67.0105 9.6360 5.3005 9.6595 28.4115 13.1520 35.9840 12.0735 80.0790 16.6253 2.4253 32.1228 10.9889 5.9830 9.2022 17.5453 4.2222 15.2233 8.9333 11.2054 194.5010 29.1218 21.1325 42.7674 31.7792 21.9090 16.1039 33.0899 19.3200 24.5800 15.3629 8.7034 14.3681 44.4354 47.2611 8.8314 54.9488 83.8151 23.8668 20.1255 13.8812 0.4465 0.5734 1.7979
temp: 298.150 k
press: 1.00000 atm
elementType: 17 17 8 7 6 6 6 6 6 6 6 6 6 6 6 6 6 6 6 1 1 1 1 1 1 1 1 1 1 1 1 1 1 1 1 1 1 1 1 1
symmnumber: 1
zpe: 859737.8 jmol-1
zpe.correction: 0.327457 hartree
zpe.thermalcorrener: 0.348973 hartree
zpe.thermalcorrenthalpy: 0.349918 hartree
zpe.thermalcorrgfe: 0.275709 hartree
zpe.sumelectzpe: -1632.839970 hartree
zpe.sumelectthermal: -1632.818453 hartree
zpe.sumelectthermalent: -1632.817509 hartree
zpe.sumelectthermalfe: -1632.891718 hartree
dipole: -2.9172 2.4903 2.0801
dipole: 4.3633
quadrupole: -133.6095 -129.8667 -128.8802
quadrupole: -8.9208 0.4275 -5.2641
quadrupole: -2.8241 0.9188 1.9053 -8.9208 0.4275 -5.2641
hfenergy: -1633.1674268 hartree
pointgroup: C01 [X(C15H21Cl2N1O1)]
dipole: 1.2216202 -1.0425936 0.6062666 debye
polarizability: 260.7536562|14.3771346|180.2032594|-3.1741226|23.6331533|144.6885879 unknown
InChI: InChI=1S/C15H21Cl2NO/c1-5-10(3)18(11(4)6-2)15(19)12-7-8-13(16)14(17)9-12/h7-11H,5-6H2,1-4H3
charge 0 multiplicity 1
40 atoms
Cl -3.759925 -1.76134 -1.46609
Cl -5.499895 0.133769 0.59328
O  0.880987 2.23198 -0.191846
N  1.500914 -0.016829 0.012428
C  2.924807 0.294441 -0.370135
C  1.212001 -1.39438 0.531012
C  3.615987 1.239054 0.65418
C  1.406173 -2.473334 -0.572823
C  3.003984 0.804491 -1.827937
C  2.030387 -1.696936 1.809858
C  0.563985 1.009141 -0.00127
C  5.143709 1.331034 0.449573
C  0.769255 -3.833929 -0.213685
C  -0.906418 0.684259 0.185312
C  -1.568974 -0.311149 -0.57361
C  -1.669234 1.521233 1.038112
C  -2.962997 -0.479687 -0.460068
C  -3.060331 1.340337 1.164243
C  -3.710895 0.335851 0.414854
H  3.453285 -0.677743 -0.327574
H  0.147222 -1.400701 0.819804
H  3.408286 0.85977 1.673532
H  3.153568 2.237985 0.582941
H  2.486447 -2.613792 -0.775991
H  0.958788 -2.097153 -1.513951
H  2.517143 0.090785 -2.51697
H  2.508971 1.783915 -1.924518
H  4.058608 0.908495 -2.138217
H  1.738112 -2.679179 2.220573
H  3.116291 -1.726543 1.607637
H  1.841703 -0.933935 2.585174
H  5.401534 1.808542 -0.51268
H  5.604905 1.936135 1.251142
H  5.619453 0.330689 0.470487
H  -0.313442 -3.72764 -0.011613
H  0.884131 -4.54974 -1.047321
H  1.237426 -4.287493 0.67831
H  -1.015902 -0.941925 -1.275672
H  -1.165666 2.325088 1.582759
H  -3.649782 1.976635 1.830559
