program: Gaussian 09
title: 000152950
version: EM64L-G09RevD.01
frameworkgroup: C1[X(C16H20O3)]
method: RPBEPBE
basis: SDD
operation: Freq
keyword: #pfreq=noraman
keyword: PBEPBE/SDD
title: #p freq=noraman PBEPBE/SDD
converged: YES YES NO NO
title: Mulliken charges:
elementType: O O O C C C C C C C C C C C C C C C C H H H H H H H H H H H H H H H H H H H H
charge: -0.219568 -0.257151 -0.246313 -0.171317 -0.582253 0.349507 -0.056114 0.007670 0.182840 0.230626 -0.662832 0.352318 -0.722573 -0.584717 -0.853680 -0.851702 -0.298732 0.293276 -0.751536 0.252994 0.234282 0.236275 0.248634 0.250304 0.216362 0.214824 0.233559 0.248111 0.304385 0.237449 0.225450 0.238469 0.239927 0.234984 0.242082 0.240277 0.248233 0.249331 0.246321
chargesum: 0.00000
title: Mulliken charges with hydrogens summed into heavy atoms:
elementType: O O O C C C C C C C C C C C C C C C C
charge: -0.219568 -0.257151 -0.246313 0.081676 -0.111696 0.349507 -0.056114 0.007670 0.182840 0.230626 -0.414198 0.352318 -0.041082 -0.103047 -0.086397 -0.138323 0.183627 0.293276 -0.007651
polarizability: 2.52363680e+02 8.82655473e+00 1.83837149e+02 -1.61934673e+01 6.65286724e+00 1.24985404e+02
1716.lowfreq: -7.7935 0.0006 0.0007 0.0008 2.3795 5.9760 13.4075 26.2727 29.0558
frequency: 13.0814 26.1790 29.0107 33.3379 46.1102 72.5516 102.1799 114.5222 145.5840 152.2096 171.3293 177.8913 195.7977 202.5527 220.3531 250.1924 259.0392 293.2814 312.8741 355.3437 356.6462 377.0075 384.1240 415.5746 478.6742 512.4356 539.7542 546.8246 556.9448 566.8306 596.4987 618.2744 639.8848 676.0087 720.2691 769.7315 784.3624 791.7022 850.6443 868.9173 889.2726 918.3169 927.2204 941.1493 975.7983 1000.5467 1008.9950 1026.5032 1033.1850 1036.2252 1042.9340 1043.9657 1069.1048 1082.1645 1086.3545 1125.1634 1136.5024 1179.2842 1180.1087 1199.1983 1205.9898 1227.9043 1237.5990 1268.2146 1273.2851 1292.4646 1297.3717 1313.4767 1362.6225 1380.3886 1383.6624 1386.0478 1400.2801 1401.3919 1424.2792 1424.9796 1453.9265 1454.9803 1456.0238 1468.6041 1471.9601 1473.0637 1479.3496 1480.5785 1483.4802 1494.2373 1498.1146 1584.9310 1599.7389 1621.6145 1648.9354 2973.4658 2974.6248 2976.3588 2982.8319 2985.8236 3006.2077 3010.0508 3023.7029 3041.9049 3048.9229 3052.5046 3063.9843 3078.9028 3086.2423 3090.1516 3091.9119 3100.0719 3108.3310 3124.0456 3139.8359
redmass: 5.8672 1.7959 2.3133 2.1368 3.5246 4.1411 3.8675 4.3037 1.2148 1.0450 2.4938 2.9057 2.5795 1.7291 1.4713 3.6863 4.7759 4.4950 2.7872 2.5254 2.6680 4.0448 3.9622 3.3710 4.1544 4.2629 3.2242 4.2188 3.2670 3.1116 4.2361 4.6329 4.7002 5.4893 4.0305 2.6926 2.6829 1.6839 4.0039 1.4656 2.4055 1.6056 2.1431 5.5452 2.1736 2.0793 1.4133 2.8048 1.6365 1.6649 1.6299 1.6559 3.3601 2.1764 1.9303 2.0853 2.3824 1.4106 1.2726 3.2796 1.6515 2.1483 1.5685 1.4023 1.2400 1.4747 1.8311 5.7698 1.3861 3.0014 1.2548 1.3710 1.2336 1.3042 3.1767 2.3400 1.0592 1.1150 1.0577 1.1981 1.0862 1.0877 1.1934 1.0738 1.1122 1.0683 1.0923 7.9075 7.0901 9.5041 9.7735 1.0823 1.0402 1.0387 1.0401 1.0578 1.0383 1.0581 1.0591 1.0995 1.0948 1.0958 1.1032 1.1003 1.1017 1.1029 1.0998 1.0940 1.0982 1.0917 1.1025
irintensity: 1.5366 0.9597 0.4773 1.6224 0.0917 2.2811 0.6306 1.7587 2.6967 0.0894 0.0598 2.0340 6.6442 0.8805 1.2935 3.5095 0.6083 17.3148 0.8473 0.4168 0.8599 4.3278 1.7909 6.6104 6.8119 5.9304 2.0782 1.9640 2.8935 2.8518 7.0489 4.0762 3.5594 0.3670 1.2018 1.5688 4.1057 2.9581 9.2279 14.1219 27.3646 4.9055 15.3741 62.7696 26.5612 124.1120 6.8754 24.1024 10.7567 6.1464 3.5421 13.9030 21.6674 2.6830 0.6362 6.8466 14.8741 3.0054 12.6150 459.8125 16.7864 10.5931 8.8251 1.5084 0.0916 3.0284 13.3605 22.8549 4.3799 2.4674 53.3304 24.4037 34.0624 21.8434 34.9516 3.7329 22.6375 35.6522 16.7644 5.3166 8.1743 11.4058 27.9908 15.4429 18.1749 2.5041 26.0224 14.3985 243.7759 80.0632 192.1409 8.0438 27.2047 28.9411 21.3143 41.7244 2.3680 4.9212 34.4542 15.5316 18.6296 17.4741 0.6910 39.6502 41.0861 7.8889 15.4585 9.3696 0.9151 18.4023 9.3157
temp: 298.150 k
press: 1.00000 atm
elementType: 8 8 8 6 6 6 6 6 6 6 6 6 6 6 6 6 6 6 6 1 1 1 1 1 1 1 1 1 1 1 1 1 1 1 1 1 1 1 1
symmnumber: 1
zpe: 843582.0 jmol-1
zpe.correction: 0.321303 hartree
zpe.thermalcorrener: 0.341512 hartree
zpe.thermalcorrenthalpy: 0.342456 hartree
zpe.thermalcorrgfe: 0.269331 hartree
zpe.sumelectzpe: -845.984925 hartree
zpe.sumelectthermal: -845.964717 hartree
zpe.sumelectthermalent: -845.963773 hartree
zpe.sumelectthermalfe: -846.036898 hartree
dipole: 0.5938 3.4488 -1.5794
dipole: 3.8395
quadrupole: -104.7469 -113.4984 -118.8674
quadrupole: -12.5896 -14.0684 0.6385
quadrupole: 7.6240 -1.1275 -6.4965 -12.5896 -14.0684 0.6385
hfenergy: -846.3062287 hartree
pointgroup: C01[X(C16H20O3)]
dipole: -0.2119828 1.3981572 0.5310625 debye
polarizability: 252.0157532|-10.9291008|183.0232449|-15.870911|-10.2086894|126.1472354 unknown
InChI: InChI=1S/C16H20O3/c1-9-7-13-8-10(2)16(18)15(13)11(3)14(9)5-6-19-12(4)17/h7,10H,5-6,8H2,1-4H3
charge 0 multiplicity 1
39 atoms
O  3.134933 -2.452007 0.224554
O  -4.056752 -0.282476 0.418225
O  -4.878042 -0.395481 -1.760674
C  4.221913 -0.429262 -0.722137
C  3.768184 1.057871 -0.68903
C  2.305326 1.009667 -0.269488
C  1.906303 -0.299357 0.109771
C  3.060839 -1.224542 -0.070627
C  0.584278 -0.573104 0.567578
C  -0.342262 0.510632 0.621313
C  1.387941 2.070281 -0.204858
C  0.061963 1.832967 0.237924
C  5.579536 -0.729846 -0.054018
C  -1.779765 0.260096 1.067579
C  0.187519 -1.977921 0.992296
C  -0.904117 3.004157 0.316114
C  -2.684433 -0.07348 -0.131059
C  -5.07963 -0.443436 -0.526335
C  -6.403821 -0.702472 0.159218
H  4.267708 -0.776122 -1.775836
H  3.902671 1.566233 -1.661309
H  4.363506 1.627449 0.051616
H  1.687821 3.08514 -0.491622
H  5.754537 -1.819489 -0.027499
H  6.408881 -0.251372 -0.605506
H  5.59688 -0.357177 0.986819
H  -2.196931 1.145351 1.578323
H  -1.828866 -0.575939 1.78571
H  0.993695 -2.692857 0.771043
H  -0.006266 -2.018712 2.082171
H  -0.73736 -2.313983 0.489127
H  -1.209727 3.208387 1.360374
H  -0.440286 3.922834 -0.079884
H  -1.830727 2.822228 -0.258618
H  -2.368283 -0.996167 -0.65051
H  -2.717886 0.741326 -0.876136
H  -6.446418 -0.203761 1.139616
H  -6.523551 -1.789168 0.323545
H  -7.22741 -0.360889 -0.48597
