program: Gaussian 09
title: 000152834
version: EM64L-G09RevD.01
frameworkgroup: C1[X(C8H13NO2)]
method: RPBEPBE
basis: SDD
operation: Freq
keyword: #p
keyword: freq=noraman
keyword: PBEPBE/SDD
title: #p freq=noraman PBEPBE/SDD
converged: YES YES NO NO
title: Mulliken charges:
elementType: O O N C C C C C C C C H H H H H H H H H H H H H
charge: -0.445129 -0.450848 -0.149893 0.252954 0.124958 -0.508396 -0.370048 -0.245907 -0.446683 -0.314039 -0.636572 0.236298 0.241352 0.265267 0.244898 0.188226 0.219636 0.207498 0.191225 0.233445 0.237784 0.242534 0.335225 0.346214
chargesum: 0.00000
title: Mulliken charges with hydrogens summed into heavy atoms:
elementType: O O N C C C C C C C C
charge: -0.109903 -0.104634 -0.149893 0.252954 0.124958 -0.030745 -0.104781 -0.001009 -0.038821 0.084685 0.077190
polarizability: 1.15829982e+02 -8.65708416e-01 1.09837611e+02 -6.35257762e+00 8.14699201e-01 7.01191931e+01
1716.lowfreq: -10.4808 -3.9689 -2.2451 -0.0009 -0.0007 -0.0006 45.8084 51.2606 85.5939
frequency: 45.5611 51.2520 85.5465 91.2475 116.6702 125.6676 202.1936 241.6716 266.0247 292.1985 305.7506 330.0804 344.2758 395.7219 476.8345 592.1310 643.3896 670.7157 717.1438 721.2459 775.5680 803.8039 848.9653 916.6110 954.5178 969.2075 974.9789 995.8736 1021.2376 1076.2589 1099.0811 1115.0822 1150.1783 1181.5295 1197.6758 1208.7081 1231.3079 1278.5699 1286.4879 1310.3240 1351.8861 1373.9347 1378.8268 1401.6036 1428.2013 1454.7906 1463.7517 1473.1297 1480.3152 1484.2372 1493.7448 1496.3522 1569.7555 2937.1463 2951.8964 2983.4051 2991.3081 3005.5685 3045.1475 3064.8322 3066.6645 3105.7073 3208.6849 3234.8653 3554.4448 3571.6347
redmass: 3.5381 3.5425 2.4695 3.1739 1.1440 3.7100 3.3315 2.0762 1.1196 2.2527 3.1770 1.5962 3.5117 4.3974 2.8956 3.5883 4.4071 3.8712 1.5578 2.6371 3.9731 1.3183 1.3198 5.7899 1.8787 1.9545 6.4728 2.6672 1.5949 1.3054 1.8353 1.3176 1.3182 1.2897 1.8156 1.2407 1.5683 1.2191 1.2184 1.4351 3.5652 2.7724 1.6388 1.3965 1.5114 2.9200 1.1784 1.0634 1.0879 1.1077 1.8096 1.4021 7.0130 1.0563 1.0685 1.0364 1.1048 1.0612 1.0939 1.1016 1.1002 1.0999 1.0901 1.1070 1.0660 1.0665
irintensity: 1.2061 2.5354 7.4430 1.6820 1.4053 0.7856 5.8419 15.7338 125.2975 12.7930 21.8953 146.5845 13.0815 6.4322 2.0479 1.9140 0.3815 8.1125 68.3971 11.2280 22.8090 1.3164 6.2836 108.7546 13.7521 1.0727 86.4147 23.4891 8.4447 12.3027 3.7769 4.0693 17.5918 16.1023 6.1348 26.4389 19.6305 15.1020 16.0950 8.9595 28.8375 12.2109 19.9868 2.1979 5.5172 2.1676 14.1327 4.8959 14.6679 15.1888 40.0805 6.2791 5.2321 57.0149 71.2686 61.1141 38.1150 31.9243 30.9246 24.0537 29.1955 15.2893 0.6871 3.3484 4.1904 3.2694
temp: 298.150 k
press: 1.00000 atm
elementType: 8 8 7 6 6 6 6 6 6 6 6 1 1 1 1 1 1 1 1 1 1 1 1 1
symmnumber: 1
zpe: 524461.5 jmol-1
zpe.correction: 0.199757 hartree
zpe.thermalcorrener: 0.212231 hartree
zpe.thermalcorrenthalpy: 0.213176 hartree
zpe.thermalcorrgfe: 0.160271 hartree
zpe.sumelectzpe: -516.953257 hartree
zpe.sumelectthermal: -516.940783 hartree
zpe.sumelectthermalent: -516.939838 hartree
zpe.sumelectthermalfe: -516.992743 hartree
dipole: -3.2421 3.0102 -0.8289
dipole: 4.5011
quadrupole: -72.4345 -62.9707 -64.2783
quadrupole: 4.6997 6.4578 4.2924
quadrupole: -5.8733 3.5905 2.2829 4.6997 6.4578 4.2924
hfenergy: -517.1530141 hartree
pointgroup: C01 [X(C8H13N1O2)]
dipole: 0.9696043 -1.4524392 -0.2935999 debye
dipolederiv: -0.6351821 0.1100346 0.1576299 0.1061024 -0.7163968 -0.2046161 0.2264104 -0.3237591 -0.3766793 -0.977013 -0.1183423 -0.0882096 -0.1176611 -0.5992103 -0.005696 -0.1060362 -0.0196021 -0.1467727 -0.3570647 0.3662513 -0.1228184 0.401795 -0.5957894 0.1073447 -0.0388662 0.0544323 -0.1250123 0.081806 -0.0710086 0.0110206 -0.1782364 0.3959275 -0.0799565 0.0386086 -0.0727024 -0.1267726 -0.0930745 0.0880302 0.071939 0.1184541 -0.237018 -0.0270957 0.0585566 0.0189857 -0.1634698 0.0147708 -0.0461001 0.028905 -0.0052194 0.076456 -0.0011679 0.1088661 0.0195211 0.0916528 -0.096108 0.0536105 0.058613 0.0637123 -0.115368 0.0571115 0.0289587 0.0528903 -0.2304191 0.1269461 -0.2484739 0.1624139 -0.1457152 -0.0832224 -0.0588863 0.0959291 -0.0758937 -0.1838741 0.5482314 -0.1094079 -0.1558836 -0.1548241 0.599254 0.0675807 -0.1943173 0.1321432 0.4388974 0.7786482 0.1217032 0.0414953 0.1175532 0.4450343 0.006167 -0.0359246 -0.0046546 0.2001715 0.3075141 -0.2214822 0.0726341 -0.1810208 0.3801623 -0.0933292 0.033517 -0.0664118 0.2503621 -0.0009726 0.036071 -0.0540713 0.0790068 0.0123191 0.1098007 -0.0430565 0.0814058 -0.0215589 0.0683583 0.0168014 0.016979 -0.0295411 -0.0781093 -0.0947966 0.0344569 -0.0592801 0.0448108 -0.0304503 0.0110335 -0.0614993 0.0275673 0.1046269 0.015353 -0.065953 0.0066605 0.1754009 0.0815458 -0.0249256 -0.0286814 -0.0614461 -0.0565575 0.0031695 -0.0254251 0.0142904 0.2051596 -0.2089705 -0.1030311 0.0206112 -0.0649724 -0.0038736 -0.02228 -0.0338564 -0.0521088 0.0296542 0.0284602 0.095422 -0.0510173 0.0398758 -0.019953 0.0477913 -0.0068587 0.0716387 -0.1153466 -0.0580952 0.0371102 -0.0864405 0.0336307 -0.0565597 0.1218959 -0.0926928 0.0760238 -0.0584639 -0.032261 -0.0170528 -0.0067217 -0.0264811 -0.1755696 -0.1379145 -0.0378202 -0.1051479 -0.012693 0.0443054 -0.1283783 -0.0404341 -0.0227461 -0.0760819 -0.0225775 -0.0412693 -0.0590889 0.0943075 -0.1202489 0.0774645 0.0617929 -0.009355 0.0868276 0.0402821 0.0926704 0.0121579 0.0285803 0.0384738 0.0795332 -0.0487929 0.0491918 0.0264973 -0.0117837 -0.0874077 0.0899903 -0.1439135 0.2787775 0.040212 -0.0508641 0.002481 0.3116838 0.1748042 -0.0500699 0.1840046 0.094441 0.2116035 -0.045075 0.0914003 -0.0421515 0.374921 0.0087992 0.1415799 0.0245047 0.0515376 unknown
polarizability: 115.7550426|-1.9589199|110.0516808|3.3818216|-4.6240638|69.9800627 unknown
InChI: InChI=1S/C8H13NO2/c1-9-4-2-7(6-11)8(9)3-5-10/h2,4,10-11H,3,5-6H2,1H3
charge 0 multiplicity 1
24 atoms
O  -2.222762 2.617565 0.515199
O  3.732161 0.781412 -0.29538
N  -0.238763 -1.549587 0.180988
C  0.110168 -0.188349 0.188987
C  -1.036328 0.544515 -0.184874
C  1.508039 0.283743 0.493123
C  -2.103734 -0.401814 -0.40349
C  -1.58862 -1.678578 -0.168411
C  -1.135052 2.039241 -0.312844
C  2.400081 0.363841 -0.761348
C  0.63702 -2.66152 0.567282
H  2.00815 -0.376755 1.226088
H  1.475441 1.288675 0.95057
H  -3.124357 -0.160362 -0.695237
H  -2.063948 -2.656715 -0.217598
H  -0.164953 2.516386 -0.055994
H  -1.407592 2.351084 -1.336508
H  1.972136 1.09673 -1.477501
H  2.446871 -0.626619 -1.264603
H  0.162516 -3.611583 0.273579
H  1.612965 -2.591673 0.056021
H  0.813281 -2.681234 1.658896
H  -2.204797 2.162535 1.395663
H  4.327376 0.926159 -1.073007
