program: Gaussian 09
title: 000152887
version: EM64L-G09RevD.01
frameworkgroup: C1[X(C15H16N2O4S)]
method: RPBEPBE
basis: SDD
operation: Freq
keyword: #p
keyword: freq=noraman
keyword: PBEPBE/SDD
title: #p freq=noraman PBEPBE/SDD
converged: YES YES NO NO
title: Mulliken charges:
elementType: S O O O O N N C C C C C C C C C C C C C C C H H H H H H H H H H H H H H H H
charge: 0.171021 -0.303776 -0.303781 -0.261815 -0.261815 -0.366849 -0.366845 -0.357385 -0.385518 -0.385528 0.498275 0.498259 0.204688 0.204688 -0.845612 -0.845595 0.135195 0.135197 -0.369768 -0.369763 -0.322834 -0.322836 0.275841 0.206745 0.202343 0.254473 0.254476 0.202347 0.314130 0.314129 0.266981 0.284417 0.284420 0.266977 0.264549 0.264550 0.283010 0.283009
chargesum: 0.00000
title: Mulliken charges with hydrogens summed into heavy atoms:
elementType: S O O O O N N C C C C C C C C C C C C C C C
charge: 0.171021 -0.303776 -0.303781 -0.261815 -0.261815 -0.052719 -0.052717 0.125202 0.071298 0.071295 0.498275 0.498259 0.204688 0.204688 -0.294214 -0.294198 0.135195 0.135197 -0.105219 -0.105213 -0.039824 -0.039827
polarizability: 2.82771330e+02 -3.06696902e-03 1.79299192e+02 1.09750819e+00 9.62018565e-04 1.66765789e+02
1716.lowfreq: -7.3119 -5.6606 -0.0009 -0.0006 -0.0003 6.1316 13.2139 24.2593 26.1023
frequency: 12.7356 23.6658 26.0604 50.0741 67.1515 94.3251 99.1092 118.2614 122.9081 151.1706 171.4652 183.2795 202.2191 239.9403 258.4797 293.0146 295.2505 314.0371 319.1334 333.0843 341.4807 389.6535 427.4970 479.2420 488.6384 491.5328 501.8856 555.6279 578.2898 590.4394 590.6153 636.4556 673.8304 683.4141 693.9553 697.3718 726.4688 726.6384 741.4704 756.7564 799.5465 814.3889 823.5818 824.5206 864.7157 872.1667 898.7010 898.9442 901.3173 924.1112 931.3186 932.4526 941.6378 975.2357 1013.9294 1014.3937 1044.2821 1068.1735 1093.3604 1112.7440 1125.7415 1144.0169 1150.6653 1201.5600 1203.8540 1206.0956 1225.4761 1227.2040 1237.0759 1247.4129 1259.8177 1282.2367 1286.3494 1302.1760 1342.9279 1347.6107 1350.9796 1364.8302 1371.9005 1417.8562 1426.6986 1443.6671 1449.4292 1453.9785 1477.7601 1492.1432 1535.8343 1541.4113 1587.8352 1591.5789 1596.6285 1601.5821 2988.4632 2995.2752 2998.8862 3031.5055 3036.0305 3060.9548 3063.6867 3077.1615 3105.2490 3107.2513 3226.4622 3226.5370 3248.8101 3248.8346 3550.8805 3555.0650
redmass: 6.9110 4.7117 4.1736 8.0649 9.4320 5.1444 5.4195 3.1238 7.2719 4.9830 7.5788 4.1317 5.5104 5.4237 2.7303 3.1532 4.7269 4.1106 4.3242 4.5722 2.5449 2.7172 4.8849 5.0883 2.9416 1.4882 2.0136 5.9381 6.6619 5.1583 5.0624 1.1217 4.7076 5.1978 5.0282 5.0732 6.2642 6.2770 2.8134 3.8326 1.7393 3.1069 1.3576 1.3288 2.3782 2.6833 1.4027 1.5829 2.8774 3.7070 4.2161 6.0291 4.3218 2.7269 1.3913 1.3111 2.7165 2.7723 1.4117 2.4750 1.7045 3.8762 3.8777 1.2851 1.4687 1.5541 1.3627 1.8181 1.6008 1.4577 1.5992 2.1111 2.0538 1.3777 1.3665 2.9715 2.9958 1.2817 1.2822 1.1164 1.1107 1.1838 1.1132 1.0817 1.7996 2.0618 7.8835 6.3359 7.1624 7.2122 6.4562 6.3531 1.0630 1.0618 1.0640 1.0587 1.0591 1.0986 1.1016 1.1005 1.1055 1.1054 1.0953 1.0953 1.1032 1.1032 1.0783 1.0774
irintensity: 0.0315 0.3693 5.9144 13.9778 4.4711 1.8669 10.6393 2.0618 1.4229 1.8122 0.2764 6.2619 4.6367 4.2095 0.6951 6.2142 0.6922 8.3907 2.6660 2.4192 14.8331 3.7593 4.3353 2.1740 34.1079 170.6564 1.3480 7.8888 4.8096 2.0367 2.7733 91.0985 1.3632 20.0267 1.9809 20.1103 6.7784 37.5170 1.6375 13.9142 1.9679 2.5047 84.2780 14.6410 7.7425 10.3756 1.3470 1.9197 28.5625 0.4968 27.1852 2.8407 2.8416 2.6260 55.8699 15.8718 4.5226 0.5194 0.0076 0.0242 3.5199 6.3955 44.0030 0.9152 3.0112 34.3873 6.6677 2.8777 31.6702 54.8907 1.4337 37.2246 15.8845 124.0047 0.7735 0.1193 0.7431 0.4182 2.8978 12.6569 22.1677 63.7756 11.9569 12.4118 29.9183 241.1814 0.5753 146.0229 53.0433 95.4423 28.0254 281.4881 22.5956 8.4211 113.9966 17.7953 2.4365 19.5103 4.9929 25.1438 2.2065 0.0164 0.0422 2.5120 0.4456 1.7696 3.5347 21.9567
temp: 298.150 k
press: 1.00000 atm
elementType: 16 8 8 8 8 7 7 6 6 6 6 6 6 6 6 6 6 6 6 6 6 6 1 1 1 1 1 1 1 1 1 1 1 1 1 1 1 1
symmnumber: 1
zpe: 765080.9 jmol-1
zpe.correction: 0.291404 hartree
zpe.thermalcorrener: 0.311755 hartree
zpe.thermalcorrenthalpy: 0.312699 hartree
zpe.thermalcorrgfe: 0.239718 hartree
zpe.sumelectzpe: -1388.039499 hartree
zpe.sumelectthermal: -1388.019148 hartree
zpe.sumelectthermalent: -1388.018204 hartree
zpe.sumelectthermalfe: -1388.091185 hartree
dipole: 3.5372 0.0003 -5.2320
dipole: 6.3155
quadrupole: -133.2194 -142.2733 -129.5478
quadrupole: 0.0002 15.7269 0.0000
quadrupole: 1.7941 -7.2598 5.4657 0.0002 15.7269 0.0000
hfenergy: -1388.3309025 hartree
pointgroup: C01 [X(C15H16N2O4S1)]
dipole: 1.3491918 0.0002151 -2.0864894 debye
polarizability: 282.7675992|-0.0070544|179.2991922|-1.2795651|0.0020837|166.7695198 unknown
InChI: InChI=1S/C15H16N2O4S/c18-14-12-4-2-10(20-12)8-22-9-11-3-5-13(21-11)15(19)17-7-1-6-16-14/h2-5,16-17H,1,6-9H2
charge 0 multiplicity 1
38 atoms
S  4.213632 -0.000316 -0.629815
O  0.770323 1.728606 -0.609876
O  0.769894 -1.728609 -0.610185
O  -2.284671 2.60853 1.21281
O  -2.285145 -2.608367 1.212498
N  -1.964224 1.569876 -0.861301
N  -1.964615 -1.569476 -0.861485
C  -3.913085 0.00041 -0.441134
C  -3.396415 1.311989 -1.083504
C  -3.396761 -1.311264 -1.083585
C  2.115427 1.967622 -0.242975
C  2.114983 -1.967835 -0.24337
C  -0.039776 2.266528 0.425022
C  -0.040229 -2.266578 0.424671
C  3.162643 1.505115 -1.190351
C  3.162208 -1.505296 -1.190726
C  -1.51106 2.166974 0.30371
C  -1.511501 -2.166758 0.303451
C  2.139189 2.629897 0.980561
C  2.138715 -2.630301 0.980063
C  0.775295 2.816349 1.404278
C  0.774815 -2.816659 1.403803
H  -3.668871 0.000348 0.63593
H  -5.019252 0.000558 -0.518062
H  -3.583689 1.30988 -2.174813
H  -3.950775 2.159755 -0.642623
H  -3.95128 -2.158921 -0.642694
H  -3.584111 -1.309075 -2.174881
H  -1.268432 1.241718 -1.532694
H  -1.268793 -1.241341 -1.532858
H  2.727074 1.261554 -2.173157
H  3.934136 2.279922 -1.332307
H  3.933485 -2.280254 -1.333038
H  2.726572 -1.261304 -2.173395
H  3.036004 2.933792 1.516615
H  3.035516 -2.934375 1.516039
H  0.416387 3.294325 2.312552
H  0.415888 -3.294722 2.312023
