program: Gaussian 09
title: 000152818
version: EM64L-G09RevD.01
frameworkgroup: C1[X(C3H5N3S)]
method: RPBEPBE
basis: SDD
operation: Freq
keyword: #pfreq=noraman
keyword: PBEPBE/SDD
title: #p freq=noraman PBEPBE/SDD
converged: NO NO NO NO
title: Mulliken charges:
elementType: S N N N C C C H H H H H
charge: 0.116111 -0.004941 -0.590392 -0.220146 -0.768172 0.238533 -0.263938 0.283115 0.283232 0.329009 0.347421 0.250167
chargesum: 0.00000
title: Mulliken charges with hydrogens summed into heavy atoms:
elementType: S N N N C C C
charge: 0.116111 -0.004941 0.086038 0.030021 -0.201825 0.238533 -0.263938
polarizability: 1.06156756e+02 -1.06709285e+01 7.87458626e+01 -1.86509298e-03 -1.56161371e-03 3.20544723e+01
1716.lowfreq: -8.1280 -0.0030 -0.0024 0.0021 8.6954 10.6246 106.6434 176.8969 305.1880
frequency: 106.6308 176.8926 305.1878 356.9220 415.0566 466.6145 500.4122 558.0953 597.0684 600.2567 613.1053 746.3757 770.6548 839.3723 901.0589 926.7058 1066.7667 1108.6533 1166.5260 1219.4250 1384.5119 1429.2710 1595.7896 1637.3175 1678.4723 3023.0784 3090.6621 3436.0980 3541.9324 3694.1375
redmass: 2.9671 5.5677 4.3738 4.7292 1.2225 9.8453 1.5662 5.0118 9.4289 7.4280 1.4931 5.6147 1.1462 3.9993 1.5890 1.9554 1.5237 1.1459 2.2259 1.4979 4.8357 1.0927 1.6708 2.9149 6.0603 1.0558 1.1074 1.0791 1.0455 1.1045
irintensity: 3.1401 8.9078 27.0169 18.5627 87.5638 1.6242 127.2056 52.0845 18.0518 4.7398 99.1797 2.4316 71.1773 26.2058 12.5776 104.5304 266.2056 0.7958 121.9504 19.3732 73.6314 17.7807 36.3162 733.0886 62.3100 25.0026 5.0232 24.2683 96.4721 45.8703
temp: 298.150 k
press: 1.00000 atm
elementType: 16 7 7 7 6 6 6 1 1 1 1 1
symmnumber: 1
zpe: 227009.7 jmol-1
zpe.correction: 0.086463 hartree
zpe.thermalcorrener: 0.093274 hartree
zpe.thermalcorrenthalpy: 0.094218 hartree
zpe.thermalcorrgfe: 0.055397 hartree
zpe.sumelectzpe: -679.096978 hartree
zpe.sumelectthermal: -679.090167 hartree
zpe.sumelectthermalent: -679.089223 hartree
zpe.sumelectthermalfe: -679.128045 hartree
dipole: -5.1352 2.7159 0.0019
dipole: 5.8092
quadrupole: -32.2666 -55.7955 -50.6804
quadrupole: 1.4646 -0.0004 0.0031
quadrupole: 13.9809 -9.5480 -4.4329 1.4646 -0.0004 0.0031
hfenergy: -679.1834414 hartree
pointgroup: C01 [X(C3H5N3S1)]
dipole: 2.1596795 -0.7478872 -0.000243 debye
dipolederiv: -0.1703247 0.2235911 0.0003792 0.1015677 -0.8635252 -0.0008884 0.000408 -0.001141 -0.1177003 -1.5737942 -0.2736906 -0.0000534 0.1057188 -0.7356253 -0.0005558 0.0004584 -0.0003875 -0.2589369 -1.3591229 -0.2895899 -0.0000647 -0.5478209 -0.3260152 0.0004187 -0.0002619 0.0004314 -0.7035431 -1.1896129 0.46733 0.0008276 0.5859417 -0.652814 -0.0005301 0.0008218 -0.0002746 -0.4084965 0.1009887 -0.0686176 0.0000229 -0.0791195 -0.3618372 -0.0003529 -0.0001348 -0.0000863 0.2073736 1.8438436 0.2262113 -0.0001918 0.0981559 0.6418566 0.0002548 -0.0002755 0.0000115 0.1553263 1.7025314 -0.2991868 -0.0009598 -0.1223145 1.6505606 0.0021234 -0.000686 0.0019913 0.0606523 -0.0471328 0.0522259 0.0784596 0.0128528 0.0742976 -0.0200293 0.0949296 -0.0625619 0.0022733 -0.0469207 0.0521443 -0.0783662 0.0128673 0.0741366 0.0200139 -0.0949881 0.0625891 0.0020108 0.275763 0.0233691 0.0000351 0.0037178 0.1493742 -0.0001865 -0.000025 -0.0002122 0.3846056 0.1875909 0.0376858 0.00007 0.0782732 0.1993451 -0.0001788 0.0000814 -0.0001943 0.395111 0.2761906 -0.1514727 -0.0001586 -0.2498405 0.1502464 -0.0000889 -0.0003279 -0.0001653 0.2813237 unknown
polarizability: 108.7360877|-6.0426711|76.1664702|-0.0110319|0.0518329|32.0545333 unknown
InChI: InChI=1S/C3H5N3S/c4-2-1-7-3(5)6-2/h5H,1,4H2
charge 0 multiplicity 1
12 atoms
S  -0.897991 -1.680091 -0.003004
N  0.044877 0.937604 0.000217
N  2.370968 0.673457 -0.000448
N  -2.340137 0.859496 0.000792
C  0.948508 -1.375069 -0.001393
C  1.103774 0.150597 -0.000587
C  -1.190123 0.277806 -0.0001
H  1.405021 -1.815992 -0.903415
H  1.403307 -1.816474 0.901281
H  3.195323 0.079083 -0.001019
H  2.478642 1.686934 0.000436
H  -3.163569 0.235249 0.000242
