program: Gaussian 09
title: 000154641
version: EM64L-G09RevD.01
frameworkgroup: C1[X(C3H6N2O2)]
method: RPBEPBE
basis: SDD
operation: Freq
keyword: #pfreq=noraman
keyword: PBEPBE/SDD
title: #p freq=noraman PBEPBE/SDD
converged: NO NO NO NO
title: Mulliken charges:
elementType: O O N N C C C H H H H H H
charge: -0.205428 -0.214302 -0.087095 0.074197 -0.354884 -0.638137 -0.005190 0.253885 0.250392 0.237102 0.237264 0.229953 0.222245
chargesum: 0.00000
title: Mulliken charges with hydrogens summed into heavy atoms:
elementType: O O N N C C C
charge: -0.205428 -0.214302 -0.087095 0.074197 0.149392 0.066181 0.217055
polarizability: 7.70757557e+01 -4.59459827e+00 5.41328809e+01 3.19761869e-01 4.16069229e+00 3.51271773e+01
1716.lowfreq: -10.2734 0.0010 0.0012 0.0013 10.1648 24.4740 58.8802 140.5422 195.4397
frequency: 57.5240 140.5109 195.4274 212.6111 267.1851 314.3495 346.7855 494.4397 498.7918 703.1770 756.5999 792.0452 921.7811 971.7785 992.9000 1085.3864 1158.7335 1255.1401 1334.8887 1351.4773 1354.7289 1374.7222 1395.4034 1444.2237 1473.9770 1481.6805 1632.0091 3002.2322 3012.9782 3030.4914 3092.9635 3101.5017 3118.1128
redmass: 2.7889 7.8146 1.1611 3.6504 3.9731 2.3614 4.4554 7.8907 5.2390 2.3857 3.5904 1.8926 2.7255 1.5978 2.6121 1.9482 2.0808 2.5068 1.4932 1.3806 1.4493 2.6186 1.4437 1.1012 1.0420 1.0500 7.4530 1.0354 1.0906 1.0592 1.1030 1.0993 1.1036
irintensity: 0.0461 8.4764 1.5733 9.5818 18.4748 1.6425 9.7540 5.4739 7.3072 19.2432 16.9581 154.4390 177.2136 3.8406 8.3337 10.2473 28.8554 38.3925 26.4605 15.1939 50.5338 123.1163 48.2593 27.6791 13.3114 10.5443 191.2972 16.5001 30.5458 11.1789 1.9767 25.1361 11.8923
temp: 298.150 k
press: 1.00000 atm
elementType: 8 8 7 7 6 6 6 1 1 1 1 1 1
symmnumber: 1
zpe: 253408.3 jmol-1
zpe.correction: 0.096518 hartree
zpe.thermalcorrener: 0.104158 hartree
zpe.thermalcorrenthalpy: 0.105102 hartree
zpe.thermalcorrgfe: 0.064295 hartree
zpe.sumelectzpe: -377.244991 hartree
zpe.sumelectthermal: -377.237351 hartree
zpe.sumelectthermalent: -377.236406 hartree
zpe.sumelectthermalfe: -377.277214 hartree
dipole: 0.2469 1.2972 0.2491
dipole: 1.3438
quadrupole: -54.2422 -38.4588 -39.1421
quadrupole: 4.6704 0.9114 0.5455
quadrupole: -10.2945 5.4889 4.8056 4.6704 0.9114 0.5455
hfenergy: -377.3415087 hartree
pointgroup: C01 [X(C3H6N2O2)]
dipole: -0.0260658 0.5194417 -0.0949268 debye
dipolederiv: -1.1066946 0.1306102 -0.0068946 -0.2051951 -0.3946041 0.0285194 0.0905118 0.0178455 -0.3418763 -1.0982081 -0.256019 0.0686485 0.4640849 -0.1454964 0.0021897 -0.1708354 -0.0133167 -0.1638536 -1.5288989 0.0534387 -0.0020825 -0.1099772 -0.444522 0.0665635 0.0673329 0.0640771 -0.1713078 1.6775982 0.4787107 -0.1381319 0.2493099 0.0601975 -0.0608657 -0.1222547 -0.0232103 -0.0278303 0.0391204 -0.0186443 0.0150539 -0.0483919 0.2967734 0.0130088 -0.0117613 -0.030729 0.2342902 0.0546317 -0.007253 0.0049726 0.0084652 -0.0091892 -0.0131041 0.0355829 0.0180483 -0.0315728 1.8199561 -0.3099317 0.0442903 -0.3331219 0.6023871 -0.1584666 0.1101209 -0.150123 0.2409381 0.0269494 -0.0138665 0.1179097 0.0098221 0.0387074 -0.0204108 0.0649728 -0.0003587 0.0503399 0.0093253 0.0142991 -0.1276224 -0.0306024 0.0348291 -0.0338147 -0.0419484 -0.002106 0.0320846 -0.0386042 -0.0088241 0.1135548 -0.0614792 0.0914553 0.0128826 0.0686501 -0.0197996 0.0169617 -0.038269 0.0007115 -0.1161846 0.0432022 0.0873149 0.0001905 -0.0806864 -0.0298935 0.0042208 0.1174763 0.0118787 -0.0037356 0.006717 -0.1330233 0.0771804 -0.010527 0.0723538 0.049361 0.0656174 -0.0751103 0.030222 0.0071663 -0.0848297 0.086127 0.000842 0.0972121 0.1082444 unknown
polarizability: 77.8834892|1.1723418|53.3515945|-0.8859119|-4.0863884|35.1007301 unknown
InChI: InChI=1S/C3H6N2O2/c1-2-5(3-6)4-7/h3H,2H2,1H3
charge 0 multiplicity 1
13 atoms
O  2.374724 -0.463083 -0.065478
O  -2.217257 -0.487685 -0.010839
N  0.032697 -0.306552 -0.109401
N  -1.115913 -1.083707 0.213201
C  -0.038651 1.072631 -0.646533
C  -0.133234 2.135457 0.472004
C  1.254624 -0.979156 0.145362
H  0.870737 1.220696 -1.252066
H  -0.929495 1.117455 -1.29738
H  -1.040743 1.99244 1.082091
H  0.751811 2.097505 1.12888
H  -0.180473 3.14103 0.01838
H  1.083273 -1.993732 0.557979
